diameter-backend-tests.log 90 KB

123456789101112131415161718192021222324252627282930313233343536373839404142434445464748495051525354555657585960616263646566676869707172737475767778798081828384858687888990919293949596979899100101102103104105106107108109110111112113114115116117118119120121122123124125126127128129130131132133134135136137138139140141142143144145146147148149150151152153154155156157158159160161162163164165166167168169170171172173174175176177178179180181182183184185186187188189190191192193194195196197198199200201202203204205206207208209210211212213214215216217218219220221222223224225226227228229230231232233234235236237238239240241242243244245246247248249250251252253254255256257258259260261262263264265266267268269270271272273274275276277278279280281282283284285286287288289290291292293294295296297298299300301302303304305306307308309310311312313314315316317318319320321322323324325326327328329330331332333334335336337338339340341342343344345346347348349350351352353354355356357358359360361362363364365366367368369370371372373374375376377378379380381382383384385386387388389390391392393394395396397398399400401402403404405406407408409410411412413414415416417418419420421422423424425426427428429430431432433434435436437438439440441442443444445446447448449450451452453454455456457458459460461462463464465466467468469470471472473474475476477478479480481482483484485486487488489490491492493494495496497498499500501502503504505506507508509510511512513514515516517518519520521522523524525526527528529530531532533534535536537538539540541542543544545546547548549550551552553554555556557558559560561562563564565566567568569570571572573574575576577578579580581582583584585586587588589590591592593594595596597598599600601602603604605606607608609610611612613614615616617618619620621622623624625626627628629630631632633634635636637638639640641642643644645646647648649650651652653654655656657658659660661662663664665666667668669670671672673674675676677678679680681682683684685686687688689690691692693694695696697698699700701702703704705706707708709710711712713714715716717718719720721722723724725726727728729730731732733734735736737738739740741742743744745746747748749750751752753754755756757758759760761762763764765766767768769770771772773774775776777778779780781782783784785786787788789790791792793794795796797798799800801802803804805806807808809810811812
  1. [INFO] Scanning for projects...
  2. [INFO] ------------------------------------------------------------------------
  3. [INFO] Reactor Build Order:
  4. [INFO]
  5. [INFO] pipe-ner-server [pom]
  6. [INFO] pipe-network-service [pom]
  7. [INFO] zksy-common [jar]
  8. [INFO] zksy-system [jar]
  9. [INFO] zksy-framework [jar]
  10. [INFO] zksy-quartz [jar]
  11. [INFO] zksy-generator [jar]
  12. [INFO] zksy-admin [jar]
  13. [INFO]
  14. [INFO] ----------------------< com.zksy:pipe-ner-server >----------------------
  15. [INFO] Building pipe-ner-server 1.0.0 [1/8]
  16. [INFO] from pom.xml
  17. [INFO] --------------------------------[ pom ]---------------------------------
  18. [INFO]
  19. [INFO] -------------------< com.zksy:pipe-network-service >--------------------
  20. [INFO] Building pipe-network-service 3.9.0 [2/8]
  21. [INFO] from pipe-network-service\pom.xml
  22. [INFO] --------------------------------[ pom ]---------------------------------
  23. [INFO]
  24. [INFO] ------------------------< com.zksy:zksy-common >------------------------
  25. [INFO] Building zksy-common 3.9.0 [3/8]
  26. [INFO] from pipe-network-service\zksy-common\pom.xml
  27. [INFO] --------------------------------[ jar ]---------------------------------
  28. [WARNING] Parameter 'parameters' is unknown for plugin 'maven-compiler-plugin:3.1:compile (default-compile)'
  29. [WARNING] Parameter 'parameters' is unknown for plugin 'maven-compiler-plugin:3.1:testCompile (default-testCompile)'
  30. [INFO]
  31. [INFO] --- resources:3.2.0:resources (default-resources) @ zksy-common ---
  32. [INFO] Using 'UTF-8' encoding to copy filtered resources.
  33. [INFO] Using 'UTF-8' encoding to copy filtered properties files.
  34. [INFO] skip non existing resourceDirectory E:\pipe-ner-server\pipe-network-service\zksy-common\src\main\resources
  35. [INFO] skip non existing resourceDirectory E:\pipe-ner-server\pipe-network-service\zksy-common\src\main\resources
  36. [INFO]
  37. [INFO] --- compiler:3.1:compile (default-compile) @ zksy-common ---
  38. [INFO] Nothing to compile - all classes are up to date
  39. [INFO]
  40. [INFO] --- resources:3.2.0:testResources (default-testResources) @ zksy-common ---
  41. [INFO] Using 'UTF-8' encoding to copy filtered resources.
  42. [INFO] Using 'UTF-8' encoding to copy filtered properties files.
  43. [INFO] skip non existing resourceDirectory E:\pipe-ner-server\pipe-network-service\zksy-common\src\test\resources
  44. [INFO]
  45. [INFO] --- compiler:3.1:testCompile (default-testCompile) @ zksy-common ---
  46. [INFO] No sources to compile
  47. [INFO]
  48. [INFO] --- surefire:2.22.2:test (default-test) @ zksy-common ---
  49. [INFO] No tests to run.
  50. [INFO]
  51. [INFO] ------------------------< com.zksy:zksy-system >------------------------
  52. [INFO] Building zksy-system 3.9.0 [4/8]
  53. [INFO] from pipe-network-service\zksy-system\pom.xml
  54. [INFO] --------------------------------[ jar ]---------------------------------
  55. [WARNING] Parameter 'parameters' is unknown for plugin 'maven-compiler-plugin:3.1:compile (default-compile)'
  56. [WARNING] Parameter 'parameters' is unknown for plugin 'maven-compiler-plugin:3.1:testCompile (default-testCompile)'
  57. [INFO]
  58. [INFO] --- resources:3.2.0:resources (default-resources) @ zksy-system ---
  59. [INFO] Using 'UTF-8' encoding to copy filtered resources.
  60. [INFO] Using 'UTF-8' encoding to copy filtered properties files.
  61. [INFO] Copying 0 resource
  62. [INFO] Copying 46 resources
  63. [INFO]
  64. [INFO] --- compiler:3.1:compile (default-compile) @ zksy-system ---
  65. [INFO] Nothing to compile - all classes are up to date
  66. [INFO]
  67. [INFO] --- resources:3.2.0:testResources (default-testResources) @ zksy-system ---
  68. [INFO] Using 'UTF-8' encoding to copy filtered resources.
  69. [INFO] Using 'UTF-8' encoding to copy filtered properties files.
  70. [INFO] skip non existing resourceDirectory E:\pipe-ner-server\pipe-network-service\zksy-system\src\test\resources
  71. [INFO]
  72. [INFO] --- compiler:3.1:testCompile (default-testCompile) @ zksy-system ---
  73. [INFO] Nothing to compile - all classes are up to date
  74. [INFO]
  75. [INFO] --- surefire:2.22.2:test (default-test) @ zksy-system ---
  76. [INFO]
  77. [INFO] ----------------------< com.zksy:zksy-framework >-----------------------
  78. [INFO] Building zksy-framework 3.9.0 [5/8]
  79. [INFO] from pipe-network-service\zksy-framework\pom.xml
  80. [INFO] --------------------------------[ jar ]---------------------------------
  81. [WARNING] Parameter 'parameters' is unknown for plugin 'maven-compiler-plugin:3.1:compile (default-compile)'
  82. [WARNING] Parameter 'parameters' is unknown for plugin 'maven-compiler-plugin:3.1:testCompile (default-testCompile)'
  83. [INFO]
  84. [INFO] --- resources:3.2.0:resources (default-resources) @ zksy-framework ---
  85. [INFO] Using 'UTF-8' encoding to copy filtered resources.
  86. [INFO] Using 'UTF-8' encoding to copy filtered properties files.
  87. [INFO] skip non existing resourceDirectory E:\pipe-ner-server\pipe-network-service\zksy-framework\src\main\resources
  88. [INFO] skip non existing resourceDirectory E:\pipe-ner-server\pipe-network-service\zksy-framework\src\main\resources
  89. [INFO]
  90. [INFO] --- compiler:3.1:compile (default-compile) @ zksy-framework ---
  91. [INFO] Nothing to compile - all classes are up to date
  92. [INFO]
  93. [INFO] --- resources:3.2.0:testResources (default-testResources) @ zksy-framework ---
  94. [INFO] Using 'UTF-8' encoding to copy filtered resources.
  95. [INFO] Using 'UTF-8' encoding to copy filtered properties files.
  96. [INFO] skip non existing resourceDirectory E:\pipe-ner-server\pipe-network-service\zksy-framework\src\test\resources
  97. [INFO]
  98. [INFO] --- compiler:3.1:testCompile (default-testCompile) @ zksy-framework ---
  99. [INFO] No sources to compile
  100. [INFO]
  101. [INFO] --- surefire:2.22.2:test (default-test) @ zksy-framework ---
  102. [INFO] No tests to run.
  103. [INFO]
  104. [INFO] ------------------------< com.zksy:zksy-quartz >------------------------
  105. [INFO] Building zksy-quartz 3.9.0 [6/8]
  106. [INFO] from pipe-network-service\zksy-quartz\pom.xml
  107. [INFO] --------------------------------[ jar ]---------------------------------
  108. [WARNING] Parameter 'parameters' is unknown for plugin 'maven-compiler-plugin:3.1:compile (default-compile)'
  109. [WARNING] Parameter 'parameters' is unknown for plugin 'maven-compiler-plugin:3.1:testCompile (default-testCompile)'
  110. [INFO]
  111. [INFO] --- resources:3.2.0:resources (default-resources) @ zksy-quartz ---
  112. [INFO] Using 'UTF-8' encoding to copy filtered resources.
  113. [INFO] Using 'UTF-8' encoding to copy filtered properties files.
  114. [INFO] Copying 0 resource
  115. [INFO] Copying 2 resources
  116. [INFO]
  117. [INFO] --- compiler:3.1:compile (default-compile) @ zksy-quartz ---
  118. [INFO] Changes detected - recompiling the module!
  119. [INFO] Compiling 18 source files to E:\pipe-ner-server\pipe-network-service\zksy-quartz\target\classes
  120. [INFO]
  121. [INFO] --- resources:3.2.0:testResources (default-testResources) @ zksy-quartz ---
  122. [INFO] Using 'UTF-8' encoding to copy filtered resources.
  123. [INFO] Using 'UTF-8' encoding to copy filtered properties files.
  124. [INFO] skip non existing resourceDirectory E:\pipe-ner-server\pipe-network-service\zksy-quartz\src\test\resources
  125. [INFO]
  126. [INFO] --- compiler:3.1:testCompile (default-testCompile) @ zksy-quartz ---
  127. [INFO] No sources to compile
  128. [INFO]
  129. [INFO] --- surefire:2.22.2:test (default-test) @ zksy-quartz ---
  130. [INFO] No tests to run.
  131. [INFO]
  132. [INFO] ----------------------< com.zksy:zksy-generator >-----------------------
  133. [INFO] Building zksy-generator 3.9.0 [7/8]
  134. [INFO] from pipe-network-service\zksy-generator\pom.xml
  135. [INFO] --------------------------------[ jar ]---------------------------------
  136. [WARNING] Parameter 'parameters' is unknown for plugin 'maven-compiler-plugin:3.1:compile (default-compile)'
  137. [WARNING] Parameter 'parameters' is unknown for plugin 'maven-compiler-plugin:3.1:testCompile (default-testCompile)'
  138. [INFO]
  139. [INFO] --- resources:3.2.0:resources (default-resources) @ zksy-generator ---
  140. [INFO] Using 'UTF-8' encoding to copy filtered resources.
  141. [INFO] Using 'UTF-8' encoding to copy filtered properties files.
  142. [INFO] Copying 0 resource
  143. [INFO] Copying 16 resources
  144. [INFO]
  145. [INFO] --- compiler:3.1:compile (default-compile) @ zksy-generator ---
  146. [INFO] Nothing to compile - all classes are up to date
  147. [INFO]
  148. [INFO] --- resources:3.2.0:testResources (default-testResources) @ zksy-generator ---
  149. [INFO] Using 'UTF-8' encoding to copy filtered resources.
  150. [INFO] Using 'UTF-8' encoding to copy filtered properties files.
  151. [INFO] skip non existing resourceDirectory E:\pipe-ner-server\pipe-network-service\zksy-generator\src\test\resources
  152. [INFO]
  153. [INFO] --- compiler:3.1:testCompile (default-testCompile) @ zksy-generator ---
  154. [INFO] No sources to compile
  155. [INFO]
  156. [INFO] --- surefire:2.22.2:test (default-test) @ zksy-generator ---
  157. [INFO] No tests to run.
  158. [INFO]
  159. [INFO] ------------------------< com.zksy:zksy-admin >-------------------------
  160. [INFO] Building zksy-admin 3.9.0 [8/8]
  161. [INFO] from pipe-network-service\zksy-admin\pom.xml
  162. [INFO] --------------------------------[ jar ]---------------------------------
  163. [WARNING] Parameter 'parameters' is unknown for plugin 'maven-compiler-plugin:3.1:compile (default-compile)'
  164. [WARNING] Parameter 'parameters' is unknown for plugin 'maven-compiler-plugin:3.1:testCompile (default-testCompile)'
  165. [WARNING] 1 problem was encountered while building the effective model for org.javassist:javassist:jar:3.21.0-GA during dependency collection step for project (use -X to see details)
  166. [INFO]
  167. [INFO] --- resources:3.2.0:resources (default-resources) @ zksy-admin ---
  168. [INFO] Using 'UTF-8' encoding to copy filtered resources.
  169. [INFO] Using 'UTF-8' encoding to copy filtered properties files.
  170. [INFO] Copying 4 resources
  171. [INFO] Copying 6 resources
  172. [INFO]
  173. [INFO] --- compiler:3.1:compile (default-compile) @ zksy-admin ---
  174. [INFO] Changes detected - recompiling the module!
  175. [INFO] Compiling 146 source files to E:\pipe-ner-server\pipe-network-service\zksy-admin\target\classes
  176. [INFO]
  177. [INFO] --- resources:3.2.0:testResources (default-testResources) @ zksy-admin ---
  178. [INFO] Using 'UTF-8' encoding to copy filtered resources.
  179. [INFO] Using 'UTF-8' encoding to copy filtered properties files.
  180. [INFO] skip non existing resourceDirectory E:\pipe-ner-server\pipe-network-service\zksy-admin\src\test\resources
  181. [INFO]
  182. [INFO] --- compiler:3.1:testCompile (default-testCompile) @ zksy-admin ---
  183. [INFO] Changes detected - recompiling the module!
  184. [INFO] Compiling 67 source files to E:\pipe-ner-server\pipe-network-service\zksy-admin\target\test-classes
  185. [WARNING] /E:/pipe-ner-server/pipe-network-service/zksy-admin/src/test/java/com/zksy/web/controller/cockpit/BusinessCockpitOverviewWarningSettingsAdapterTest.java: 某些输入文件使用了未经检查或不安全的操作。
  186. [WARNING] /E:/pipe-ner-server/pipe-network-service/zksy-admin/src/test/java/com/zksy/web/controller/cockpit/BusinessCockpitOverviewWarningSettingsAdapterTest.java: 有关详细信息, 请使用 -Xlint:unchecked 重新编译。
  187. [INFO]
  188. [INFO] --- surefire:2.22.2:test (default-test) @ zksy-admin ---
  189. [INFO]
  190. [INFO] -------------------------------------------------------
  191. [INFO] T E S T S
  192. [INFO] -------------------------------------------------------
  193. [INFO] Running com.zksy.web.controller.cockpit.CockpitFacilityGeometryControllerTest
  194. 15:42:39.354 [main] DEBUG org.jboss.logging - Logging Provider: org.jboss.logging.Log4j2LoggerProvider
  195. 15:42:39.356 [main] INFO org.hibernate.validator.internal.util.Version - HV000001: Hibernate Validator 6.2.5.Final
  196. 15:42:39.372 [main] DEBUG org.hibernate.validator.messageinterpolation.ResourceBundleMessageInterpolator - Loaded expression factory via original TCCL
  197. 15:42:39.372 [main] DEBUG org.hibernate.validator.internal.engine.AbstractConfigurationImpl - Setting custom MessageInterpolator of type org.springframework.validation.beanvalidation.LocaleContextMessageInterpolator
  198. 15:42:39.373 [main] DEBUG org.hibernate.validator.internal.engine.AbstractConfigurationImpl - Setting custom ParameterNameProvider of type org.springframework.validation.beanvalidation.LocalValidatorFactoryBean$1
  199. 15:42:39.375 [main] DEBUG org.hibernate.validator.internal.xml.config.ValidationXmlParser - Trying to load META-INF/validation.xml for XML based Validator configuration.
  200. 15:42:39.376 [main] DEBUG org.hibernate.validator.internal.xml.config.ResourceLoaderHelper - Trying to load META-INF/validation.xml via TCCL
  201. 15:42:39.376 [main] DEBUG org.hibernate.validator.internal.xml.config.ResourceLoaderHelper - Trying to load META-INF/validation.xml via Hibernate Validator's class loader
  202. 15:42:39.376 [main] DEBUG org.hibernate.validator.internal.xml.config.ValidationXmlParser - No META-INF/validation.xml found. Using annotation based configuration only.
  203. 15:42:39.379 [main] DEBUG org.hibernate.validator.internal.engine.resolver.TraversableResolvers - Cannot find javax.persistence.Persistence on classpath. Assuming non JPA 2 environment. All properties will per default be traversable.
  204. 15:42:39.456 [main] DEBUG org.hibernate.validator.internal.engine.ValidatorFactoryConfigurationHelper - HV000252: Using org.hibernate.validator.internal.engine.DefaultPropertyNodeNameProvider as property node name provider.
  205. 15:42:39.460 [main] DEBUG org.hibernate.validator.internal.engine.ValidatorFactoryConfigurationHelper - HV000234: Using org.springframework.validation.beanvalidation.LocaleContextMessageInterpolator as ValidatorFactory-scoped message interpolator.
  206. 15:42:39.460 [main] DEBUG org.hibernate.validator.internal.engine.ValidatorFactoryConfigurationHelper - HV000234: Using org.hibernate.validator.internal.engine.resolver.TraverseAllTraversableResolver as ValidatorFactory-scoped traversable resolver.
  207. 15:42:39.460 [main] DEBUG org.hibernate.validator.internal.engine.ValidatorFactoryConfigurationHelper - HV000234: Using org.hibernate.validator.internal.util.ExecutableParameterNameProvider as ValidatorFactory-scoped parameter name provider.
  208. 15:42:39.460 [main] DEBUG org.hibernate.validator.internal.engine.ValidatorFactoryConfigurationHelper - HV000234: Using org.hibernate.validator.internal.engine.DefaultClockProvider as ValidatorFactory-scoped clock provider.
  209. 15:42:39.460 [main] DEBUG org.hibernate.validator.internal.engine.ValidatorFactoryConfigurationHelper - HV000234: Using org.hibernate.validator.internal.engine.scripting.DefaultScriptEvaluatorFactory as ValidatorFactory-scoped script evaluator factory.
  210. 15:42:39.560 [main] DEBUG _org.springframework.web.servlet.HandlerMapping.Mappings -
  211. c.z.w.c.c.CockpitFacilityGeometryController:
  212. {GET [/api/cockpit/v1/infrastructure/geometry]}: geometry()
  213. 15:42:39.563 [main] DEBUG org.springframework.web.servlet.mvc.method.annotation.RequestMappingHandlerMapping - 1 mappings in org.springframework.web.servlet.mvc.method.annotation.RequestMappingHandlerMapping
  214. 15:42:39.795 [main] DEBUG org.springframework.web.servlet.mvc.method.annotation.RequestMappingHandlerAdapter - ControllerAdvice beans: 0 @ModelAttribute, 0 @InitBinder, 1 RequestBodyAdvice, 1 ResponseBodyAdvice
  215. 15:42:39.818 [main] DEBUG org.springframework.web.servlet.mvc.method.annotation.ExceptionHandlerExceptionResolver - ControllerAdvice beans: 0 @ExceptionHandler, 1 ResponseBodyAdvice
  216. 15:42:39.837 [main] INFO org.springframework.mock.web.MockServletContext - Initializing Spring TestDispatcherServlet ''
  217. 15:42:39.837 [main] INFO org.springframework.test.web.servlet.TestDispatcherServlet - Initializing Servlet ''
  218. 15:42:39.838 [main] DEBUG org.springframework.test.web.servlet.TestDispatcherServlet - Detected AcceptHeaderLocaleResolver
  219. 15:42:39.839 [main] DEBUG org.springframework.test.web.servlet.TestDispatcherServlet - Detected FixedThemeResolver
  220. 15:42:39.839 [main] DEBUG org.springframework.test.web.servlet.TestDispatcherServlet - Detected org.springframework.web.servlet.view.DefaultRequestToViewNameTranslator@54755dd9
  221. 15:42:39.839 [main] DEBUG org.springframework.test.web.servlet.TestDispatcherServlet - Detected org.springframework.web.servlet.support.SessionFlashMapManager@f1f7db2
  222. 15:42:39.839 [main] DEBUG org.springframework.test.web.servlet.TestDispatcherServlet - enableLoggingRequestDetails='false': request parameters and headers will be masked to prevent unsafe logging of potentially sensitive data
  223. 15:42:39.839 [main] INFO org.springframework.test.web.servlet.TestDispatcherServlet - Completed initialization in 2 ms
  224. 15:42:40.114 [main] DEBUG org.springframework.test.web.servlet.TestDispatcherServlet - GET "/api/cockpit/v1/infrastructure/geometry", parameters={}
  225. 15:42:40.117 [main] DEBUG org.springframework.web.servlet.mvc.method.annotation.RequestMappingHandlerMapping - Mapped to com.zksy.web.controller.cockpit.CockpitFacilityGeometryController#geometry()
  226. 15:42:40.154 [main] DEBUG org.springframework.web.servlet.mvc.method.annotation.HttpEntityMethodProcessor - Using 'application/json', given [*/*] and supported [application/json, application/*+json]
  227. 15:42:40.154 [main] DEBUG org.springframework.web.servlet.mvc.method.annotation.HttpEntityMethodProcessor - Writing [{msg=操作成功, code=200, data=com.zksy.cockpit.geometry.CockpitFacilityGeometryResponse@26582ca}]
  228. 15:42:40.173 [main] DEBUG org.springframework.test.web.servlet.TestDispatcherServlet - Completed 200 OK
  229. 15:42:40.206 [main] DEBUG com.jayway.jsonpath.internal.path.CompiledPath - Evaluating path: $['code']
  230. 15:42:40.209 [main] DEBUG com.jayway.jsonpath.internal.path.CompiledPath - Evaluating path: $['data']['type']
  231. 15:42:40.212 [main] DEBUG com.jayway.jsonpath.internal.path.CompiledPath - Evaluating path: $['data']['features']
  232. 15:42:40.212 [main] DEBUG com.jayway.jsonpath.internal.path.CompiledPath - Evaluating path: $['data']['coverage']
  233. 15:42:40.213 [main] DEBUG com.jayway.jsonpath.internal.path.CompiledPath - Evaluating path: $['data']['coverage'][4]['state']
  234. 15:42:40.221 [main] DEBUG org.hibernate.validator.messageinterpolation.ResourceBundleMessageInterpolator - Loaded expression factory via original TCCL
  235. 15:42:40.222 [main] DEBUG org.hibernate.validator.internal.engine.AbstractConfigurationImpl - Setting custom MessageInterpolator of type org.springframework.validation.beanvalidation.LocaleContextMessageInterpolator
  236. 15:42:40.222 [main] DEBUG org.hibernate.validator.internal.engine.AbstractConfigurationImpl - Setting custom ParameterNameProvider of type org.springframework.validation.beanvalidation.LocalValidatorFactoryBean$1
  237. 15:42:40.222 [main] DEBUG org.hibernate.validator.internal.xml.config.ValidationXmlParser - Trying to load META-INF/validation.xml for XML based Validator configuration.
  238. 15:42:40.222 [main] DEBUG org.hibernate.validator.internal.xml.config.ResourceLoaderHelper - Trying to load META-INF/validation.xml via TCCL
  239. 15:42:40.222 [main] DEBUG org.hibernate.validator.internal.xml.config.ResourceLoaderHelper - Trying to load META-INF/validation.xml via Hibernate Validator's class loader
  240. 15:42:40.222 [main] DEBUG org.hibernate.validator.internal.xml.config.ValidationXmlParser - No META-INF/validation.xml found. Using annotation based configuration only.
  241. 15:42:40.223 [main] DEBUG org.hibernate.validator.internal.engine.resolver.TraversableResolvers - Cannot find javax.persistence.Persistence on classpath. Assuming non JPA 2 environment. All properties will per default be traversable.
  242. 15:42:40.226 [main] DEBUG org.hibernate.validator.internal.engine.ValidatorFactoryConfigurationHelper - HV000252: Using org.hibernate.validator.internal.engine.DefaultPropertyNodeNameProvider as property node name provider.
  243. 15:42:40.226 [main] DEBUG org.hibernate.validator.internal.engine.ValidatorFactoryConfigurationHelper - HV000234: Using org.springframework.validation.beanvalidation.LocaleContextMessageInterpolator as ValidatorFactory-scoped message interpolator.
  244. 15:42:40.226 [main] DEBUG org.hibernate.validator.internal.engine.ValidatorFactoryConfigurationHelper - HV000234: Using org.hibernate.validator.internal.engine.resolver.TraverseAllTraversableResolver as ValidatorFactory-scoped traversable resolver.
  245. 15:42:40.226 [main] DEBUG org.hibernate.validator.internal.engine.ValidatorFactoryConfigurationHelper - HV000234: Using org.hibernate.validator.internal.util.ExecutableParameterNameProvider as ValidatorFactory-scoped parameter name provider.
  246. 15:42:40.226 [main] DEBUG org.hibernate.validator.internal.engine.ValidatorFactoryConfigurationHelper - HV000234: Using org.hibernate.validator.internal.engine.DefaultClockProvider as ValidatorFactory-scoped clock provider.
  247. 15:42:40.226 [main] DEBUG org.hibernate.validator.internal.engine.ValidatorFactoryConfigurationHelper - HV000234: Using org.hibernate.validator.internal.engine.scripting.DefaultScriptEvaluatorFactory as ValidatorFactory-scoped script evaluator factory.
  248. 15:42:40.227 [main] DEBUG _org.springframework.web.servlet.HandlerMapping.Mappings -
  249. c.z.w.c.c.CockpitFacilityGeometryController:
  250. {GET [/api/cockpit/v1/infrastructure/geometry]}: geometry()
  251. 15:42:40.228 [main] DEBUG org.springframework.web.servlet.mvc.method.annotation.RequestMappingHandlerMapping - 1 mappings in org.springframework.web.servlet.mvc.method.annotation.RequestMappingHandlerMapping
  252. 15:42:40.231 [main] DEBUG org.springframework.web.servlet.mvc.method.annotation.RequestMappingHandlerAdapter - ControllerAdvice beans: 0 @ModelAttribute, 0 @InitBinder, 1 RequestBodyAdvice, 1 ResponseBodyAdvice
  253. 15:42:40.233 [main] DEBUG org.springframework.web.servlet.mvc.method.annotation.ExceptionHandlerExceptionResolver - ControllerAdvice beans: 0 @ExceptionHandler, 1 ResponseBodyAdvice
  254. 15:42:40.233 [main] INFO org.springframework.mock.web.MockServletContext - Initializing Spring TestDispatcherServlet ''
  255. 15:42:40.233 [main] INFO org.springframework.test.web.servlet.TestDispatcherServlet - Initializing Servlet ''
  256. 15:42:40.233 [main] DEBUG org.springframework.test.web.servlet.TestDispatcherServlet - Detected AcceptHeaderLocaleResolver
  257. 15:42:40.234 [main] DEBUG org.springframework.test.web.servlet.TestDispatcherServlet - Detected FixedThemeResolver
  258. 15:42:40.234 [main] DEBUG org.springframework.test.web.servlet.TestDispatcherServlet - Detected org.springframework.web.servlet.view.DefaultRequestToViewNameTranslator@3887c7d7
  259. 15:42:40.234 [main] DEBUG org.springframework.test.web.servlet.TestDispatcherServlet - Detected org.springframework.web.servlet.support.SessionFlashMapManager@b1b471
  260. 15:42:40.234 [main] DEBUG org.springframework.test.web.servlet.TestDispatcherServlet - enableLoggingRequestDetails='false': request parameters and headers will be masked to prevent unsafe logging of potentially sensitive data
  261. 15:42:40.234 [main] INFO org.springframework.test.web.servlet.TestDispatcherServlet - Completed initialization in 1 ms
  262. 15:42:40.237 [main] DEBUG org.springframework.test.web.servlet.TestDispatcherServlet - GET "/api/cockpit/v1/infrastructure/geometry", parameters={}
  263. 15:42:40.237 [main] DEBUG org.springframework.web.servlet.mvc.method.annotation.RequestMappingHandlerMapping - Mapped to com.zksy.web.controller.cockpit.CockpitFacilityGeometryController#geometry()
  264. 15:42:40.238 [main] DEBUG org.springframework.web.servlet.mvc.method.annotation.HttpEntityMethodProcessor - Using 'application/json', given [*/*] and supported [application/json, application/*+json]
  265. 15:42:40.239 [main] DEBUG org.springframework.web.servlet.mvc.method.annotation.HttpEntityMethodProcessor - Writing [{msg=操作成功, code=200, data=com.zksy.cockpit.geometry.CockpitFacilityGeometryResponse@443a06ad}]
  266. 15:42:40.246 [main] DEBUG org.springframework.test.web.servlet.TestDispatcherServlet - Completed 200 OK
  267. 15:42:40.246 [main] DEBUG com.jayway.jsonpath.internal.path.CompiledPath - Evaluating path: $['data']['features'][0]['type']
  268. 15:42:40.247 [main] DEBUG com.jayway.jsonpath.internal.path.CompiledPath - Evaluating path: $['data']['features'][0]['geometry']
  269. 15:42:40.247 [main] DEBUG com.jayway.jsonpath.internal.path.CompiledPath - Evaluating path: $['data']['features'][0]['properties']['networkId']
  270. 15:42:40.247 [main] DEBUG com.jayway.jsonpath.internal.path.CompiledPath - Evaluating path: $['data']['features'][0]['properties']['pointType']
  271. 15:42:40.248 [main] DEBUG com.jayway.jsonpath.internal.path.CompiledPath - Evaluating path: $['data']['features'][0]['properties']['sourceCoordinates'][0][0]
  272. 15:42:40.248 [main] DEBUG com.jayway.jsonpath.internal.path.CompiledPath - Evaluating path: $['data']['features'][0]['properties']['coordinateValidation']['state']
  273. 15:42:40.248 [main] DEBUG com.jayway.jsonpath.internal.path.CompiledPath - Evaluating path: $['data']['features'][0]['properties']['coordinateValidation']['reason']
  274. 15:42:40.248 [main] DEBUG com.jayway.jsonpath.internal.path.CompiledPath - Evaluating path: $['data']['features'][0]['properties']['coordinateValidation']['renderable']
  275. 15:42:40.248 [main] DEBUG com.jayway.jsonpath.internal.path.CompiledPath - Evaluating path: $['data']['features'][0]['properties']['coordinateValidation']['crs']
  276. 15:42:40.251 [main] DEBUG org.hibernate.validator.messageinterpolation.ResourceBundleMessageInterpolator - Loaded expression factory via original TCCL
  277. 15:42:40.251 [main] DEBUG org.hibernate.validator.internal.engine.AbstractConfigurationImpl - Setting custom MessageInterpolator of type org.springframework.validation.beanvalidation.LocaleContextMessageInterpolator
  278. 15:42:40.251 [main] DEBUG org.hibernate.validator.internal.engine.AbstractConfigurationImpl - Setting custom ParameterNameProvider of type org.springframework.validation.beanvalidation.LocalValidatorFactoryBean$1
  279. 15:42:40.252 [main] DEBUG org.hibernate.validator.internal.xml.config.ValidationXmlParser - Trying to load META-INF/validation.xml for XML based Validator configuration.
  280. 15:42:40.252 [main] DEBUG org.hibernate.validator.internal.xml.config.ResourceLoaderHelper - Trying to load META-INF/validation.xml via TCCL
  281. 15:42:40.253 [main] DEBUG org.hibernate.validator.internal.xml.config.ResourceLoaderHelper - Trying to load META-INF/validation.xml via Hibernate Validator's class loader
  282. 15:42:40.254 [main] DEBUG org.hibernate.validator.internal.xml.config.ValidationXmlParser - No META-INF/validation.xml found. Using annotation based configuration only.
  283. 15:42:40.254 [main] DEBUG org.hibernate.validator.internal.engine.resolver.TraversableResolvers - Cannot find javax.persistence.Persistence on classpath. Assuming non JPA 2 environment. All properties will per default be traversable.
  284. 15:42:40.256 [main] DEBUG org.hibernate.validator.internal.engine.ValidatorFactoryConfigurationHelper - HV000252: Using org.hibernate.validator.internal.engine.DefaultPropertyNodeNameProvider as property node name provider.
  285. 15:42:40.256 [main] DEBUG org.hibernate.validator.internal.engine.ValidatorFactoryConfigurationHelper - HV000234: Using org.springframework.validation.beanvalidation.LocaleContextMessageInterpolator as ValidatorFactory-scoped message interpolator.
  286. 15:42:40.256 [main] DEBUG org.hibernate.validator.internal.engine.ValidatorFactoryConfigurationHelper - HV000234: Using org.hibernate.validator.internal.engine.resolver.TraverseAllTraversableResolver as ValidatorFactory-scoped traversable resolver.
  287. 15:42:40.256 [main] DEBUG org.hibernate.validator.internal.engine.ValidatorFactoryConfigurationHelper - HV000234: Using org.hibernate.validator.internal.util.ExecutableParameterNameProvider as ValidatorFactory-scoped parameter name provider.
  288. 15:42:40.256 [main] DEBUG org.hibernate.validator.internal.engine.ValidatorFactoryConfigurationHelper - HV000234: Using org.hibernate.validator.internal.engine.DefaultClockProvider as ValidatorFactory-scoped clock provider.
  289. 15:42:40.256 [main] DEBUG org.hibernate.validator.internal.engine.ValidatorFactoryConfigurationHelper - HV000234: Using org.hibernate.validator.internal.engine.scripting.DefaultScriptEvaluatorFactory as ValidatorFactory-scoped script evaluator factory.
  290. 15:42:40.257 [main] DEBUG _org.springframework.web.servlet.HandlerMapping.Mappings -
  291. c.z.w.c.c.CockpitFacilityGeometryController:
  292. {GET [/api/cockpit/v1/infrastructure/geometry]}: geometry()
  293. 15:42:40.258 [main] DEBUG org.springframework.web.servlet.mvc.method.annotation.RequestMappingHandlerMapping - 1 mappings in org.springframework.web.servlet.mvc.method.annotation.RequestMappingHandlerMapping
  294. 15:42:40.261 [main] DEBUG org.springframework.web.servlet.mvc.method.annotation.RequestMappingHandlerAdapter - ControllerAdvice beans: 0 @ModelAttribute, 0 @InitBinder, 1 RequestBodyAdvice, 1 ResponseBodyAdvice
  295. 15:42:40.263 [main] DEBUG org.springframework.web.servlet.mvc.method.annotation.ExceptionHandlerExceptionResolver - ControllerAdvice beans: 0 @ExceptionHandler, 1 ResponseBodyAdvice
  296. 15:42:40.263 [main] INFO org.springframework.mock.web.MockServletContext - Initializing Spring TestDispatcherServlet ''
  297. 15:42:40.263 [main] INFO org.springframework.test.web.servlet.TestDispatcherServlet - Initializing Servlet ''
  298. 15:42:40.263 [main] DEBUG org.springframework.test.web.servlet.TestDispatcherServlet - Detected AcceptHeaderLocaleResolver
  299. 15:42:40.263 [main] DEBUG org.springframework.test.web.servlet.TestDispatcherServlet - Detected FixedThemeResolver
  300. 15:42:40.263 [main] DEBUG org.springframework.test.web.servlet.TestDispatcherServlet - Detected org.springframework.web.servlet.view.DefaultRequestToViewNameTranslator@37606fee
  301. 15:42:40.263 [main] DEBUG org.springframework.test.web.servlet.TestDispatcherServlet - Detected org.springframework.web.servlet.support.SessionFlashMapManager@33d28f0a
  302. 15:42:40.263 [main] DEBUG org.springframework.test.web.servlet.TestDispatcherServlet - enableLoggingRequestDetails='false': request parameters and headers will be masked to prevent unsafe logging of potentially sensitive data
  303. 15:42:40.263 [main] INFO org.springframework.test.web.servlet.TestDispatcherServlet - Completed initialization in 0 ms
  304. 15:42:40.263 [main] DEBUG org.springframework.test.web.servlet.TestDispatcherServlet - POST "/api/cockpit/v1/infrastructure/geometry", parameters={}
  305. 15:42:40.265 [main] WARN org.springframework.web.servlet.mvc.support.DefaultHandlerExceptionResolver - Resolved [org.springframework.web.HttpRequestMethodNotSupportedException: Request method 'POST' not supported]
  306. 15:42:40.265 [main] DEBUG org.springframework.test.web.servlet.TestDispatcherServlet - Completed 405 METHOD_NOT_ALLOWED
  307. 15:42:40.270 [main] DEBUG org.hibernate.validator.messageinterpolation.ResourceBundleMessageInterpolator - Loaded expression factory via original TCCL
  308. 15:42:40.270 [main] DEBUG org.hibernate.validator.internal.engine.AbstractConfigurationImpl - Setting custom MessageInterpolator of type org.springframework.validation.beanvalidation.LocaleContextMessageInterpolator
  309. 15:42:40.270 [main] DEBUG org.hibernate.validator.internal.engine.AbstractConfigurationImpl - Setting custom ParameterNameProvider of type org.springframework.validation.beanvalidation.LocalValidatorFactoryBean$1
  310. 15:42:40.271 [main] DEBUG org.hibernate.validator.internal.xml.config.ValidationXmlParser - Trying to load META-INF/validation.xml for XML based Validator configuration.
  311. 15:42:40.271 [main] DEBUG org.hibernate.validator.internal.xml.config.ResourceLoaderHelper - Trying to load META-INF/validation.xml via TCCL
  312. 15:42:40.271 [main] DEBUG org.hibernate.validator.internal.xml.config.ResourceLoaderHelper - Trying to load META-INF/validation.xml via Hibernate Validator's class loader
  313. 15:42:40.271 [main] DEBUG org.hibernate.validator.internal.xml.config.ValidationXmlParser - No META-INF/validation.xml found. Using annotation based configuration only.
  314. 15:42:40.272 [main] DEBUG org.hibernate.validator.internal.engine.resolver.TraversableResolvers - Cannot find javax.persistence.Persistence on classpath. Assuming non JPA 2 environment. All properties will per default be traversable.
  315. 15:42:40.272 [main] DEBUG org.hibernate.validator.internal.engine.ValidatorFactoryConfigurationHelper - HV000252: Using org.hibernate.validator.internal.engine.DefaultPropertyNodeNameProvider as property node name provider.
  316. 15:42:40.273 [main] DEBUG org.hibernate.validator.internal.engine.ValidatorFactoryConfigurationHelper - HV000234: Using org.springframework.validation.beanvalidation.LocaleContextMessageInterpolator as ValidatorFactory-scoped message interpolator.
  317. 15:42:40.273 [main] DEBUG org.hibernate.validator.internal.engine.ValidatorFactoryConfigurationHelper - HV000234: Using org.hibernate.validator.internal.engine.resolver.TraverseAllTraversableResolver as ValidatorFactory-scoped traversable resolver.
  318. 15:42:40.273 [main] DEBUG org.hibernate.validator.internal.engine.ValidatorFactoryConfigurationHelper - HV000234: Using org.hibernate.validator.internal.util.ExecutableParameterNameProvider as ValidatorFactory-scoped parameter name provider.
  319. 15:42:40.273 [main] DEBUG org.hibernate.validator.internal.engine.ValidatorFactoryConfigurationHelper - HV000234: Using org.hibernate.validator.internal.engine.DefaultClockProvider as ValidatorFactory-scoped clock provider.
  320. 15:42:40.273 [main] DEBUG org.hibernate.validator.internal.engine.ValidatorFactoryConfigurationHelper - HV000234: Using org.hibernate.validator.internal.engine.scripting.DefaultScriptEvaluatorFactory as ValidatorFactory-scoped script evaluator factory.
  321. 15:42:40.274 [main] DEBUG _org.springframework.web.servlet.HandlerMapping.Mappings -
  322. c.z.w.c.c.CockpitFacilityGeometryController:
  323. {GET [/api/cockpit/v1/infrastructure/geometry]}: geometry()
  324. 15:42:40.274 [main] DEBUG org.springframework.web.servlet.mvc.method.annotation.RequestMappingHandlerMapping - 1 mappings in org.springframework.web.servlet.mvc.method.annotation.RequestMappingHandlerMapping
  325. 15:42:40.279 [main] DEBUG org.springframework.web.servlet.mvc.method.annotation.RequestMappingHandlerAdapter - ControllerAdvice beans: 0 @ModelAttribute, 0 @InitBinder, 1 RequestBodyAdvice, 1 ResponseBodyAdvice
  326. 15:42:40.281 [main] DEBUG org.springframework.web.servlet.mvc.method.annotation.ExceptionHandlerExceptionResolver - ControllerAdvice beans: 0 @ExceptionHandler, 1 ResponseBodyAdvice
  327. 15:42:40.281 [main] INFO org.springframework.mock.web.MockServletContext - Initializing Spring TestDispatcherServlet ''
  328. 15:42:40.281 [main] INFO org.springframework.test.web.servlet.TestDispatcherServlet - Initializing Servlet ''
  329. 15:42:40.281 [main] DEBUG org.springframework.test.web.servlet.TestDispatcherServlet - Detected AcceptHeaderLocaleResolver
  330. 15:42:40.281 [main] DEBUG org.springframework.test.web.servlet.TestDispatcherServlet - Detected FixedThemeResolver
  331. 15:42:40.281 [main] DEBUG org.springframework.test.web.servlet.TestDispatcherServlet - Detected org.springframework.web.servlet.view.DefaultRequestToViewNameTranslator@3f6cce7f
  332. 15:42:40.281 [main] DEBUG org.springframework.test.web.servlet.TestDispatcherServlet - Detected org.springframework.web.servlet.support.SessionFlashMapManager@2725ca05
  333. 15:42:40.281 [main] DEBUG org.springframework.test.web.servlet.TestDispatcherServlet - enableLoggingRequestDetails='false': request parameters and headers will be masked to prevent unsafe logging of potentially sensitive data
  334. 15:42:40.282 [main] INFO org.springframework.test.web.servlet.TestDispatcherServlet - Completed initialization in 1 ms
  335. 15:42:40.283 [main] DEBUG org.hibernate.validator.messageinterpolation.ResourceBundleMessageInterpolator - Loaded expression factory via original TCCL
  336. 15:42:40.283 [main] DEBUG org.hibernate.validator.internal.engine.AbstractConfigurationImpl - Setting custom MessageInterpolator of type org.springframework.validation.beanvalidation.LocaleContextMessageInterpolator
  337. 15:42:40.283 [main] DEBUG org.hibernate.validator.internal.engine.AbstractConfigurationImpl - Setting custom ParameterNameProvider of type org.springframework.validation.beanvalidation.LocalValidatorFactoryBean$1
  338. 15:42:40.284 [main] DEBUG org.hibernate.validator.internal.xml.config.ValidationXmlParser - Trying to load META-INF/validation.xml for XML based Validator configuration.
  339. 15:42:40.284 [main] DEBUG org.hibernate.validator.internal.xml.config.ResourceLoaderHelper - Trying to load META-INF/validation.xml via TCCL
  340. 15:42:40.284 [main] DEBUG org.hibernate.validator.internal.xml.config.ResourceLoaderHelper - Trying to load META-INF/validation.xml via Hibernate Validator's class loader
  341. 15:42:40.285 [main] DEBUG org.hibernate.validator.internal.xml.config.ValidationXmlParser - No META-INF/validation.xml found. Using annotation based configuration only.
  342. 15:42:40.285 [main] DEBUG org.hibernate.validator.internal.engine.resolver.TraversableResolvers - Cannot find javax.persistence.Persistence on classpath. Assuming non JPA 2 environment. All properties will per default be traversable.
  343. 15:42:40.286 [main] DEBUG org.hibernate.validator.internal.engine.ValidatorFactoryConfigurationHelper - HV000252: Using org.hibernate.validator.internal.engine.DefaultPropertyNodeNameProvider as property node name provider.
  344. 15:42:40.287 [main] DEBUG org.hibernate.validator.internal.engine.ValidatorFactoryConfigurationHelper - HV000234: Using org.springframework.validation.beanvalidation.LocaleContextMessageInterpolator as ValidatorFactory-scoped message interpolator.
  345. 15:42:40.287 [main] DEBUG org.hibernate.validator.internal.engine.ValidatorFactoryConfigurationHelper - HV000234: Using org.hibernate.validator.internal.engine.resolver.TraverseAllTraversableResolver as ValidatorFactory-scoped traversable resolver.
  346. 15:42:40.287 [main] DEBUG org.hibernate.validator.internal.engine.ValidatorFactoryConfigurationHelper - HV000234: Using org.hibernate.validator.internal.util.ExecutableParameterNameProvider as ValidatorFactory-scoped parameter name provider.
  347. 15:42:40.287 [main] DEBUG org.hibernate.validator.internal.engine.ValidatorFactoryConfigurationHelper - HV000234: Using org.hibernate.validator.internal.engine.DefaultClockProvider as ValidatorFactory-scoped clock provider.
  348. 15:42:40.287 [main] DEBUG org.hibernate.validator.internal.engine.ValidatorFactoryConfigurationHelper - HV000234: Using org.hibernate.validator.internal.engine.scripting.DefaultScriptEvaluatorFactory as ValidatorFactory-scoped script evaluator factory.
  349. 15:42:40.288 [main] DEBUG _org.springframework.web.servlet.HandlerMapping.Mappings -
  350. c.z.w.c.c.CockpitFacilityGeometryController:
  351. {GET [/api/cockpit/v1/infrastructure/geometry]}: geometry()
  352. 15:42:40.289 [main] DEBUG org.springframework.web.servlet.mvc.method.annotation.RequestMappingHandlerMapping - 1 mappings in org.springframework.web.servlet.mvc.method.annotation.RequestMappingHandlerMapping
  353. 15:42:40.294 [main] DEBUG org.springframework.web.servlet.mvc.method.annotation.RequestMappingHandlerAdapter - ControllerAdvice beans: 0 @ModelAttribute, 0 @InitBinder, 1 RequestBodyAdvice, 1 ResponseBodyAdvice
  354. 15:42:40.296 [main] DEBUG org.springframework.web.servlet.mvc.method.annotation.ExceptionHandlerExceptionResolver - ControllerAdvice beans: 0 @ExceptionHandler, 1 ResponseBodyAdvice
  355. 15:42:40.296 [main] INFO org.springframework.mock.web.MockServletContext - Initializing Spring TestDispatcherServlet ''
  356. 15:42:40.296 [main] INFO org.springframework.test.web.servlet.TestDispatcherServlet - Initializing Servlet ''
  357. 15:42:40.296 [main] DEBUG org.springframework.test.web.servlet.TestDispatcherServlet - Detected AcceptHeaderLocaleResolver
  358. 15:42:40.296 [main] DEBUG org.springframework.test.web.servlet.TestDispatcherServlet - Detected FixedThemeResolver
  359. 15:42:40.296 [main] DEBUG org.springframework.test.web.servlet.TestDispatcherServlet - Detected org.springframework.web.servlet.view.DefaultRequestToViewNameTranslator@14f060b8
  360. 15:42:40.296 [main] DEBUG org.springframework.test.web.servlet.TestDispatcherServlet - Detected org.springframework.web.servlet.support.SessionFlashMapManager@7a0ab480
  361. 15:42:40.296 [main] DEBUG org.springframework.test.web.servlet.TestDispatcherServlet - enableLoggingRequestDetails='false': request parameters and headers will be masked to prevent unsafe logging of potentially sensitive data
  362. 15:42:40.296 [main] INFO org.springframework.test.web.servlet.TestDispatcherServlet - Completed initialization in 0 ms
  363. 15:42:40.296 [main] DEBUG org.springframework.test.web.servlet.TestDispatcherServlet - GET "/api/cockpit/v1/infrastructure/geometry", parameters={}
  364. 15:42:40.296 [main] DEBUG org.springframework.web.servlet.mvc.method.annotation.RequestMappingHandlerMapping - Mapped to com.zksy.web.controller.cockpit.CockpitFacilityGeometryController#geometry()
  365. 15:42:40.302 [main] DEBUG org.springframework.web.servlet.mvc.method.annotation.HttpEntityMethodProcessor - Using 'application/json', given [*/*] and supported [application/json, application/*+json]
  366. 15:42:40.303 [main] DEBUG org.springframework.web.servlet.mvc.method.annotation.HttpEntityMethodProcessor - Writing [{msg=操作成功, code=200, data=com.zksy.cockpit.geometry.CockpitFacilityGeometryResponse@212fafd1}]
  367. 15:42:40.309 [main] DEBUG org.springframework.test.web.servlet.TestDispatcherServlet - Completed 200 OK
  368. 15:42:40.309 [main] DEBUG com.jayway.jsonpath.internal.path.CompiledPath - Evaluating path: $['data']['features']
  369. 15:42:40.309 [main] DEBUG com.jayway.jsonpath.internal.path.CompiledPath - Evaluating path: $['data']['features'][0]['geometry']['type']
  370. 15:42:40.310 [main] DEBUG com.jayway.jsonpath.internal.path.CompiledPath - Evaluating path: $['data']['features'][0]['properties']['diameter']
  371. 15:42:40.310 [main] DEBUG com.jayway.jsonpath.internal.path.CompiledPath - Evaluating path: $['data']['features'][1]['properties']['diameter']
  372. 15:42:40.310 [main] DEBUG com.jayway.jsonpath.internal.path.CompiledPath - Evaluating path: $['data']['features'][0]['geometry']['coordinates']
  373. 15:42:40.310 [main] DEBUG com.jayway.jsonpath.internal.path.CompiledPath - Evaluating path: $['data']['features'][0]['geometry']['coordinates'][0][0]
  374. 15:42:40.311 [main] DEBUG com.jayway.jsonpath.internal.path.CompiledPath - Evaluating path: $['data']['features'][0]['geometry']['coordinates'][0][1]
  375. 15:42:40.311 [main] DEBUG com.jayway.jsonpath.internal.path.CompiledPath - Evaluating path: $['data']['features'][0]['geometry']['coordinates'][1][0]
  376. 15:42:40.311 [main] DEBUG com.jayway.jsonpath.internal.path.CompiledPath - Evaluating path: $['data']['features'][0]['geometry']['coordinates'][1][1]
  377. 15:42:40.311 [main] DEBUG com.jayway.jsonpath.internal.path.CompiledPath - Evaluating path: $['data']['features'][1]['geometry']['type']
  378. 15:42:40.312 [main] DEBUG com.jayway.jsonpath.internal.path.CompiledPath - Evaluating path: $['data']['features'][1]['geometry']['coordinates']
  379. 15:42:40.312 [main] DEBUG com.jayway.jsonpath.internal.path.CompiledPath - Evaluating path: $['data']['features'][1]['geometry']['coordinates'][0]
  380. 15:42:40.312 [main] DEBUG com.jayway.jsonpath.internal.path.CompiledPath - Evaluating path: $['data']['features'][1]['geometry']['coordinates'][1]
  381. 15:42:40.312 [main] DEBUG com.jayway.jsonpath.internal.path.CompiledPath - Evaluating path: $['data']['features'][1]['properties']['pointType']
  382. 15:42:40.313 [main] DEBUG com.jayway.jsonpath.internal.path.CompiledPath - Evaluating path: $['data']['features'][1]['properties']['networkId']
  383. 15:42:40.313 [main] DEBUG com.jayway.jsonpath.internal.path.CompiledPath - Evaluating path: $['data']['features'][1]['properties']['coordinateValidation']['state']
  384. 15:42:40.313 [main] DEBUG com.jayway.jsonpath.internal.path.CompiledPath - Evaluating path: $['data']['features'][1]['properties']['coordinateValidation']['renderable']
  385. 15:42:40.315 [main] DEBUG org.hibernate.validator.messageinterpolation.ResourceBundleMessageInterpolator - Loaded expression factory via original TCCL
  386. 15:42:40.315 [main] DEBUG org.hibernate.validator.internal.engine.AbstractConfigurationImpl - Setting custom MessageInterpolator of type org.springframework.validation.beanvalidation.LocaleContextMessageInterpolator
  387. 15:42:40.315 [main] DEBUG org.hibernate.validator.internal.engine.AbstractConfigurationImpl - Setting custom ParameterNameProvider of type org.springframework.validation.beanvalidation.LocalValidatorFactoryBean$1
  388. 15:42:40.315 [main] DEBUG org.hibernate.validator.internal.xml.config.ValidationXmlParser - Trying to load META-INF/validation.xml for XML based Validator configuration.
  389. 15:42:40.315 [main] DEBUG org.hibernate.validator.internal.xml.config.ResourceLoaderHelper - Trying to load META-INF/validation.xml via TCCL
  390. 15:42:40.315 [main] DEBUG org.hibernate.validator.internal.xml.config.ResourceLoaderHelper - Trying to load META-INF/validation.xml via Hibernate Validator's class loader
  391. 15:42:40.315 [main] DEBUG org.hibernate.validator.internal.xml.config.ValidationXmlParser - No META-INF/validation.xml found. Using annotation based configuration only.
  392. 15:42:40.316 [main] DEBUG org.hibernate.validator.internal.engine.resolver.TraversableResolvers - Cannot find javax.persistence.Persistence on classpath. Assuming non JPA 2 environment. All properties will per default be traversable.
  393. 15:42:40.317 [main] DEBUG org.hibernate.validator.internal.engine.ValidatorFactoryConfigurationHelper - HV000252: Using org.hibernate.validator.internal.engine.DefaultPropertyNodeNameProvider as property node name provider.
  394. 15:42:40.318 [main] DEBUG org.hibernate.validator.internal.engine.ValidatorFactoryConfigurationHelper - HV000234: Using org.springframework.validation.beanvalidation.LocaleContextMessageInterpolator as ValidatorFactory-scoped message interpolator.
  395. 15:42:40.318 [main] DEBUG org.hibernate.validator.internal.engine.ValidatorFactoryConfigurationHelper - HV000234: Using org.hibernate.validator.internal.engine.resolver.TraverseAllTraversableResolver as ValidatorFactory-scoped traversable resolver.
  396. 15:42:40.318 [main] DEBUG org.hibernate.validator.internal.engine.ValidatorFactoryConfigurationHelper - HV000234: Using org.hibernate.validator.internal.util.ExecutableParameterNameProvider as ValidatorFactory-scoped parameter name provider.
  397. 15:42:40.318 [main] DEBUG org.hibernate.validator.internal.engine.ValidatorFactoryConfigurationHelper - HV000234: Using org.hibernate.validator.internal.engine.DefaultClockProvider as ValidatorFactory-scoped clock provider.
  398. 15:42:40.318 [main] DEBUG org.hibernate.validator.internal.engine.ValidatorFactoryConfigurationHelper - HV000234: Using org.hibernate.validator.internal.engine.scripting.DefaultScriptEvaluatorFactory as ValidatorFactory-scoped script evaluator factory.
  399. 15:42:40.320 [main] DEBUG _org.springframework.web.servlet.HandlerMapping.Mappings -
  400. c.z.w.c.c.CockpitFacilityGeometryController:
  401. {GET [/api/cockpit/v1/infrastructure/geometry]}: geometry()
  402. 15:42:40.320 [main] DEBUG org.springframework.web.servlet.mvc.method.annotation.RequestMappingHandlerMapping - 1 mappings in org.springframework.web.servlet.mvc.method.annotation.RequestMappingHandlerMapping
  403. 15:42:40.325 [main] DEBUG org.springframework.web.servlet.mvc.method.annotation.RequestMappingHandlerAdapter - ControllerAdvice beans: 0 @ModelAttribute, 0 @InitBinder, 1 RequestBodyAdvice, 1 ResponseBodyAdvice
  404. 15:42:40.326 [main] DEBUG org.springframework.web.servlet.mvc.method.annotation.ExceptionHandlerExceptionResolver - ControllerAdvice beans: 0 @ExceptionHandler, 1 ResponseBodyAdvice
  405. 15:42:40.326 [main] INFO org.springframework.mock.web.MockServletContext - Initializing Spring TestDispatcherServlet ''
  406. 15:42:40.326 [main] INFO org.springframework.test.web.servlet.TestDispatcherServlet - Initializing Servlet ''
  407. 15:42:40.326 [main] DEBUG org.springframework.test.web.servlet.TestDispatcherServlet - Detected AcceptHeaderLocaleResolver
  408. 15:42:40.327 [main] DEBUG org.springframework.test.web.servlet.TestDispatcherServlet - Detected FixedThemeResolver
  409. 15:42:40.327 [main] DEBUG org.springframework.test.web.servlet.TestDispatcherServlet - Detected org.springframework.web.servlet.view.DefaultRequestToViewNameTranslator@546ed2a0
  410. 15:42:40.327 [main] DEBUG org.springframework.test.web.servlet.TestDispatcherServlet - Detected org.springframework.web.servlet.support.SessionFlashMapManager@5bfc79cb
  411. 15:42:40.327 [main] DEBUG org.springframework.test.web.servlet.TestDispatcherServlet - enableLoggingRequestDetails='false': request parameters and headers will be masked to prevent unsafe logging of potentially sensitive data
  412. 15:42:40.327 [main] INFO org.springframework.test.web.servlet.TestDispatcherServlet - Completed initialization in 1 ms
  413. 15:42:40.328 [main] DEBUG org.springframework.test.web.servlet.TestDispatcherServlet - GET "/api/cockpit/v1/infrastructure/geometry", parameters={}
  414. 15:42:40.329 [main] DEBUG org.springframework.web.servlet.mvc.method.annotation.RequestMappingHandlerMapping - Mapped to com.zksy.web.controller.cockpit.CockpitFacilityGeometryController#geometry()
  415. 15:42:40.331 [main] DEBUG org.springframework.web.servlet.mvc.method.annotation.ExceptionHandlerExceptionResolver - Using @ExceptionHandler com.zksy.web.controller.cockpit.CockpitFacilityGeometryController#handleReadFailure(HttpServletRequest, RuntimeException)
  416. 15:42:40.333 [main] ERROR com.zksy.web.controller.cockpit.CockpitFacilityGeometryController - Facility geometry read failed
  417. org.springframework.transaction.CannotCreateTransactionException: private connection detail
  418. at com.zksy.web.controller.cockpit.CockpitFacilityGeometryController.geometry(CockpitFacilityGeometryController.java:31)
  419. at java.base/jdk.internal.reflect.NativeMethodAccessorImpl.invoke0(Native Method)
  420. at java.base/jdk.internal.reflect.NativeMethodAccessorImpl.invoke(NativeMethodAccessorImpl.java:77)
  421. at java.base/jdk.internal.reflect.DelegatingMethodAccessorImpl.invoke(DelegatingMethodAccessorImpl.java:43)
  422. at java.base/java.lang.reflect.Method.invoke(Method.java:568)
  423. at org.springframework.web.method.support.InvocableHandlerMethod.doInvoke(InvocableHandlerMethod.java:205)
  424. at org.springframework.web.method.support.InvocableHandlerMethod.invokeForRequest(InvocableHandlerMethod.java:150)
  425. at org.springframework.web.servlet.mvc.method.annotation.ServletInvocableHandlerMethod.invokeAndHandle(ServletInvocableHandlerMethod.java:117)
  426. at org.springframework.web.servlet.mvc.method.annotation.RequestMappingHandlerAdapter.invokeHandlerMethod(RequestMappingHandlerAdapter.java:903)
  427. at org.springframework.web.servlet.mvc.method.annotation.RequestMappingHandlerAdapter.handleInternal(RequestMappingHandlerAdapter.java:809)
  428. at org.springframework.web.servlet.mvc.method.AbstractHandlerMethodAdapter.handle(AbstractHandlerMethodAdapter.java:87)
  429. at org.springframework.web.servlet.DispatcherServlet.doDispatch(DispatcherServlet.java:1072)
  430. at org.springframework.web.servlet.DispatcherServlet.doService(DispatcherServlet.java:965)
  431. at org.springframework.web.servlet.FrameworkServlet.processRequest(FrameworkServlet.java:1006)
  432. at org.springframework.web.servlet.FrameworkServlet.doGet(FrameworkServlet.java:898)
  433. at javax.servlet.http.HttpServlet.service(HttpServlet.java:529)
  434. at org.springframework.web.servlet.FrameworkServlet.service(FrameworkServlet.java:883)
  435. at org.springframework.test.web.servlet.TestDispatcherServlet.service(TestDispatcherServlet.java:72)
  436. at javax.servlet.http.HttpServlet.service(HttpServlet.java:623)
  437. at org.springframework.mock.web.MockFilterChain$ServletFilterProxy.doFilter(MockFilterChain.java:167)
  438. at org.springframework.mock.web.MockFilterChain.doFilter(MockFilterChain.java:134)
  439. at org.springframework.test.web.servlet.MockMvc.perform(MockMvc.java:201)
  440. at com.zksy.web.controller.cockpit.CockpitFacilityGeometryControllerTest.transactionProxyFailureIsAlsoMappedToSanitized500(CockpitFacilityGeometryControllerTest.java:148)
  441. at java.base/jdk.internal.reflect.NativeMethodAccessorImpl.invoke0(Native Method)
  442. at java.base/jdk.internal.reflect.NativeMethodAccessorImpl.invoke(NativeMethodAccessorImpl.java:77)
  443. at java.base/jdk.internal.reflect.DelegatingMethodAccessorImpl.invoke(DelegatingMethodAccessorImpl.java:43)
  444. at java.base/java.lang.reflect.Method.invoke(Method.java:568)
  445. at org.junit.platform.commons.util.ReflectionUtils.invokeMethod(ReflectionUtils.java:688)
  446. at org.junit.jupiter.engine.execution.MethodInvocation.proceed(MethodInvocation.java:60)
  447. at org.junit.jupiter.engine.execution.InvocationInterceptorChain$ValidatingInvocation.proceed(InvocationInterceptorChain.java:131)
  448. at org.junit.jupiter.engine.extension.TimeoutExtension.intercept(TimeoutExtension.java:149)
  449. at org.junit.jupiter.engine.extension.TimeoutExtension.interceptTestableMethod(TimeoutExtension.java:140)
  450. at org.junit.jupiter.engine.extension.TimeoutExtension.interceptTestMethod(TimeoutExtension.java:84)
  451. at org.junit.jupiter.engine.execution.ExecutableInvoker$ReflectiveInterceptorCall.lambda$ofVoidMethod$0(ExecutableInvoker.java:115)
  452. at org.junit.jupiter.engine.execution.ExecutableInvoker.lambda$invoke$0(ExecutableInvoker.java:105)
  453. at org.junit.jupiter.engine.execution.InvocationInterceptorChain$InterceptedInvocation.proceed(InvocationInterceptorChain.java:106)
  454. at org.junit.jupiter.engine.execution.InvocationInterceptorChain.proceed(InvocationInterceptorChain.java:64)
  455. at org.junit.jupiter.engine.execution.InvocationInterceptorChain.chainAndInvoke(InvocationInterceptorChain.java:45)
  456. at org.junit.jupiter.engine.execution.InvocationInterceptorChain.invoke(InvocationInterceptorChain.java:37)
  457. at org.junit.jupiter.engine.execution.ExecutableInvoker.invoke(ExecutableInvoker.java:104)
  458. at org.junit.jupiter.engine.execution.ExecutableInvoker.invoke(ExecutableInvoker.java:98)
  459. at org.junit.jupiter.engine.descriptor.TestMethodTestDescriptor.lambda$invokeTestMethod$6(TestMethodTestDescriptor.java:210)
  460. at org.junit.platform.engine.support.hierarchical.ThrowableCollector.execute(ThrowableCollector.java:73)
  461. at org.junit.jupiter.engine.descriptor.TestMethodTestDescriptor.invokeTestMethod(TestMethodTestDescriptor.java:206)
  462. at org.junit.jupiter.engine.descriptor.TestMethodTestDescriptor.execute(TestMethodTestDescriptor.java:131)
  463. at org.junit.jupiter.engine.descriptor.TestMethodTestDescriptor.execute(TestMethodTestDescriptor.java:65)
  464. at org.junit.platform.engine.support.hierarchical.NodeTestTask.lambda$executeRecursively$5(NodeTestTask.java:139)
  465. at org.junit.platform.engine.support.hierarchical.ThrowableCollector.execute(ThrowableCollector.java:73)
  466. at org.junit.platform.engine.support.hierarchical.NodeTestTask.lambda$executeRecursively$7(NodeTestTask.java:129)
  467. at org.junit.platform.engine.support.hierarchical.Node.around(Node.java:137)
  468. at org.junit.platform.engine.support.hierarchical.NodeTestTask.lambda$executeRecursively$8(NodeTestTask.java:127)
  469. at org.junit.platform.engine.support.hierarchical.ThrowableCollector.execute(ThrowableCollector.java:73)
  470. at org.junit.platform.engine.support.hierarchical.NodeTestTask.executeRecursively(NodeTestTask.java:126)
  471. at org.junit.platform.engine.support.hierarchical.NodeTestTask.execute(NodeTestTask.java:84)
  472. at java.base/java.util.ArrayList.forEach(ArrayList.java:1511)
  473. at org.junit.platform.engine.support.hierarchical.SameThreadHierarchicalTestExecutorService.invokeAll(SameThreadHierarchicalTestExecutorService.java:38)
  474. at org.junit.platform.engine.support.hierarchical.NodeTestTask.lambda$executeRecursively$5(NodeTestTask.java:143)
  475. at org.junit.platform.engine.support.hierarchical.ThrowableCollector.execute(ThrowableCollector.java:73)
  476. at org.junit.platform.engine.support.hierarchical.NodeTestTask.lambda$executeRecursively$7(NodeTestTask.java:129)
  477. at org.junit.platform.engine.support.hierarchical.Node.around(Node.java:137)
  478. at org.junit.platform.engine.support.hierarchical.NodeTestTask.lambda$executeRecursively$8(NodeTestTask.java:127)
  479. at org.junit.platform.engine.support.hierarchical.ThrowableCollector.execute(ThrowableCollector.java:73)
  480. at org.junit.platform.engine.support.hierarchical.NodeTestTask.executeRecursively(NodeTestTask.java:126)
  481. at org.junit.platform.engine.support.hierarchical.NodeTestTask.execute(NodeTestTask.java:84)
  482. at java.base/java.util.ArrayList.forEach(ArrayList.java:1511)
  483. at org.junit.platform.engine.support.hierarchical.SameThreadHierarchicalTestExecutorService.invokeAll(SameThreadHierarchicalTestExecutorService.java:38)
  484. at org.junit.platform.engine.support.hierarchical.NodeTestTask.lambda$executeRecursively$5(NodeTestTask.java:143)
  485. at org.junit.platform.engine.support.hierarchical.ThrowableCollector.execute(ThrowableCollector.java:73)
  486. at org.junit.platform.engine.support.hierarchical.NodeTestTask.lambda$executeRecursively$7(NodeTestTask.java:129)
  487. at org.junit.platform.engine.support.hierarchical.Node.around(Node.java:137)
  488. at org.junit.platform.engine.support.hierarchical.NodeTestTask.lambda$executeRecursively$8(NodeTestTask.java:127)
  489. at org.junit.platform.engine.support.hierarchical.ThrowableCollector.execute(ThrowableCollector.java:73)
  490. at org.junit.platform.engine.support.hierarchical.NodeTestTask.executeRecursively(NodeTestTask.java:126)
  491. at org.junit.platform.engine.support.hierarchical.NodeTestTask.execute(NodeTestTask.java:84)
  492. at org.junit.platform.engine.support.hierarchical.SameThreadHierarchicalTestExecutorService.submit(SameThreadHierarchicalTestExecutorService.java:32)
  493. at org.junit.platform.engine.support.hierarchical.HierarchicalTestExecutor.execute(HierarchicalTestExecutor.java:57)
  494. at org.junit.platform.engine.support.hierarchical.HierarchicalTestEngine.execute(HierarchicalTestEngine.java:51)
  495. at org.junit.platform.launcher.core.DefaultLauncher.execute(DefaultLauncher.java:220)
  496. at org.junit.platform.launcher.core.DefaultLauncher.lambda$execute$6(DefaultLauncher.java:188)
  497. at org.junit.platform.launcher.core.DefaultLauncher.withInterceptedStreams(DefaultLauncher.java:202)
  498. at org.junit.platform.launcher.core.DefaultLauncher.execute(DefaultLauncher.java:181)
  499. at org.junit.platform.launcher.core.DefaultLauncher.execute(DefaultLauncher.java:128)
  500. at org.apache.maven.surefire.junitplatform.JUnitPlatformProvider.invokeAllTests(JUnitPlatformProvider.java:150)
  501. at org.apache.maven.surefire.junitplatform.JUnitPlatformProvider.invoke(JUnitPlatformProvider.java:124)
  502. at org.apache.maven.surefire.booter.ForkedBooter.invokeProviderInSameClassLoader(ForkedBooter.java:384)
  503. at org.apache.maven.surefire.booter.ForkedBooter.runSuitesInProcess(ForkedBooter.java:345)
  504. at org.apache.maven.surefire.booter.ForkedBooter.execute(ForkedBooter.java:126)
  505. at org.apache.maven.surefire.booter.ForkedBooter.main(ForkedBooter.java:418)
  506. 15:42:40.336 [main] DEBUG org.springframework.web.servlet.mvc.method.annotation.HttpEntityMethodProcessor - Using 'application/json', given [*/*] and supported [application/json, application/*+json]
  507. 15:42:40.336 [main] DEBUG org.springframework.web.servlet.mvc.method.annotation.HttpEntityMethodProcessor - Writing [{msg=facility geometry source unavailable, code=500, data=com.zksy.cockpit.foundation.CockpitErrorPa (truncated)...]
  508. 15:42:40.339 [main] DEBUG org.springframework.web.servlet.mvc.method.annotation.ExceptionHandlerExceptionResolver - Resolved [org.springframework.transaction.CannotCreateTransactionException: private connection detail]
  509. 15:42:40.339 [main] DEBUG org.springframework.test.web.servlet.TestDispatcherServlet - Completed 500 INTERNAL_SERVER_ERROR
  510. 15:42:40.339 [main] DEBUG com.jayway.jsonpath.internal.path.CompiledPath - Evaluating path: $['code']
  511. 15:42:40.339 [main] DEBUG com.jayway.jsonpath.internal.path.CompiledPath - Evaluating path: $['data']['category']
  512. 15:42:40.339 [main] DEBUG com.jayway.jsonpath.internal.path.CompiledPath - Evaluating path: $['data']['message']
  513. 15:42:40.339 [main] DEBUG com.jayway.jsonpath.internal.path.CompiledPath - Evaluating path: $['data']['requestId']
  514. 15:42:40.341 [main] DEBUG org.hibernate.validator.messageinterpolation.ResourceBundleMessageInterpolator - Loaded expression factory via original TCCL
  515. 15:42:40.341 [main] DEBUG org.hibernate.validator.internal.engine.AbstractConfigurationImpl - Setting custom MessageInterpolator of type org.springframework.validation.beanvalidation.LocaleContextMessageInterpolator
  516. 15:42:40.341 [main] DEBUG org.hibernate.validator.internal.engine.AbstractConfigurationImpl - Setting custom ParameterNameProvider of type org.springframework.validation.beanvalidation.LocalValidatorFactoryBean$1
  517. 15:42:40.342 [main] DEBUG org.hibernate.validator.internal.xml.config.ValidationXmlParser - Trying to load META-INF/validation.xml for XML based Validator configuration.
  518. 15:42:40.342 [main] DEBUG org.hibernate.validator.internal.xml.config.ResourceLoaderHelper - Trying to load META-INF/validation.xml via TCCL
  519. 15:42:40.342 [main] DEBUG org.hibernate.validator.internal.xml.config.ResourceLoaderHelper - Trying to load META-INF/validation.xml via Hibernate Validator's class loader
  520. 15:42:40.342 [main] DEBUG org.hibernate.validator.internal.xml.config.ValidationXmlParser - No META-INF/validation.xml found. Using annotation based configuration only.
  521. 15:42:40.343 [main] DEBUG org.hibernate.validator.internal.engine.resolver.TraversableResolvers - Cannot find javax.persistence.Persistence on classpath. Assuming non JPA 2 environment. All properties will per default be traversable.
  522. 15:42:40.344 [main] DEBUG org.hibernate.validator.internal.engine.ValidatorFactoryConfigurationHelper - HV000252: Using org.hibernate.validator.internal.engine.DefaultPropertyNodeNameProvider as property node name provider.
  523. 15:42:40.345 [main] DEBUG org.hibernate.validator.internal.engine.ValidatorFactoryConfigurationHelper - HV000234: Using org.springframework.validation.beanvalidation.LocaleContextMessageInterpolator as ValidatorFactory-scoped message interpolator.
  524. 15:42:40.345 [main] DEBUG org.hibernate.validator.internal.engine.ValidatorFactoryConfigurationHelper - HV000234: Using org.hibernate.validator.internal.engine.resolver.TraverseAllTraversableResolver as ValidatorFactory-scoped traversable resolver.
  525. 15:42:40.345 [main] DEBUG org.hibernate.validator.internal.engine.ValidatorFactoryConfigurationHelper - HV000234: Using org.hibernate.validator.internal.util.ExecutableParameterNameProvider as ValidatorFactory-scoped parameter name provider.
  526. 15:42:40.345 [main] DEBUG org.hibernate.validator.internal.engine.ValidatorFactoryConfigurationHelper - HV000234: Using org.hibernate.validator.internal.engine.DefaultClockProvider as ValidatorFactory-scoped clock provider.
  527. 15:42:40.345 [main] DEBUG org.hibernate.validator.internal.engine.ValidatorFactoryConfigurationHelper - HV000234: Using org.hibernate.validator.internal.engine.scripting.DefaultScriptEvaluatorFactory as ValidatorFactory-scoped script evaluator factory.
  528. 15:42:40.346 [main] DEBUG _org.springframework.web.servlet.HandlerMapping.Mappings -
  529. c.z.w.c.c.CockpitFacilityGeometryController:
  530. {GET [/api/cockpit/v1/infrastructure/geometry]}: geometry()
  531. 15:42:40.346 [main] DEBUG org.springframework.web.servlet.mvc.method.annotation.RequestMappingHandlerMapping - 1 mappings in org.springframework.web.servlet.mvc.method.annotation.RequestMappingHandlerMapping
  532. 15:42:40.350 [main] DEBUG org.springframework.web.servlet.mvc.method.annotation.RequestMappingHandlerAdapter - ControllerAdvice beans: 0 @ModelAttribute, 0 @InitBinder, 1 RequestBodyAdvice, 1 ResponseBodyAdvice
  533. 15:42:40.353 [main] DEBUG org.springframework.web.servlet.mvc.method.annotation.ExceptionHandlerExceptionResolver - ControllerAdvice beans: 0 @ExceptionHandler, 1 ResponseBodyAdvice
  534. 15:42:40.353 [main] INFO org.springframework.mock.web.MockServletContext - Initializing Spring TestDispatcherServlet ''
  535. 15:42:40.353 [main] INFO org.springframework.test.web.servlet.TestDispatcherServlet - Initializing Servlet ''
  536. 15:42:40.354 [main] DEBUG org.springframework.test.web.servlet.TestDispatcherServlet - Detected AcceptHeaderLocaleResolver
  537. 15:42:40.354 [main] DEBUG org.springframework.test.web.servlet.TestDispatcherServlet - Detected FixedThemeResolver
  538. 15:42:40.354 [main] DEBUG org.springframework.test.web.servlet.TestDispatcherServlet - Detected org.springframework.web.servlet.view.DefaultRequestToViewNameTranslator@236c098
  539. 15:42:40.354 [main] DEBUG org.springframework.test.web.servlet.TestDispatcherServlet - Detected org.springframework.web.servlet.support.SessionFlashMapManager@68e2d03e
  540. 15:42:40.354 [main] DEBUG org.springframework.test.web.servlet.TestDispatcherServlet - enableLoggingRequestDetails='false': request parameters and headers will be masked to prevent unsafe logging of potentially sensitive data
  541. 15:42:40.354 [main] INFO org.springframework.test.web.servlet.TestDispatcherServlet - Completed initialization in 0 ms
  542. 15:42:40.355 [main] DEBUG org.springframework.test.web.servlet.TestDispatcherServlet - GET "/api/cockpit/v1/infrastructure/geometry", parameters={}
  543. 15:42:40.355 [main] DEBUG org.springframework.web.servlet.mvc.method.annotation.RequestMappingHandlerMapping - Mapped to com.zksy.web.controller.cockpit.CockpitFacilityGeometryController#geometry()
  544. 15:42:40.356 [main] DEBUG org.springframework.web.servlet.mvc.method.annotation.ExceptionHandlerExceptionResolver - Using @ExceptionHandler com.zksy.web.controller.cockpit.CockpitFacilityGeometryController#handleReadFailure(HttpServletRequest, RuntimeException)
  545. 15:42:40.356 [main] ERROR com.zksy.web.controller.cockpit.CockpitFacilityGeometryController - Facility geometry read failed
  546. com.zksy.cockpit.foundation.CockpitReadException: private database details
  547. at com.zksy.web.controller.cockpit.CockpitFacilityGeometryController.geometry(CockpitFacilityGeometryController.java:31)
  548. at java.base/jdk.internal.reflect.NativeMethodAccessorImpl.invoke0(Native Method)
  549. at java.base/jdk.internal.reflect.NativeMethodAccessorImpl.invoke(NativeMethodAccessorImpl.java:77)
  550. at java.base/jdk.internal.reflect.DelegatingMethodAccessorImpl.invoke(DelegatingMethodAccessorImpl.java:43)
  551. at java.base/java.lang.reflect.Method.invoke(Method.java:568)
  552. at org.springframework.web.method.support.InvocableHandlerMethod.doInvoke(InvocableHandlerMethod.java:205)
  553. at org.springframework.web.method.support.InvocableHandlerMethod.invokeForRequest(InvocableHandlerMethod.java:150)
  554. at org.springframework.web.servlet.mvc.method.annotation.ServletInvocableHandlerMethod.invokeAndHandle(ServletInvocableHandlerMethod.java:117)
  555. at org.springframework.web.servlet.mvc.method.annotation.RequestMappingHandlerAdapter.invokeHandlerMethod(RequestMappingHandlerAdapter.java:903)
  556. at org.springframework.web.servlet.mvc.method.annotation.RequestMappingHandlerAdapter.handleInternal(RequestMappingHandlerAdapter.java:809)
  557. at org.springframework.web.servlet.mvc.method.AbstractHandlerMethodAdapter.handle(AbstractHandlerMethodAdapter.java:87)
  558. at org.springframework.web.servlet.DispatcherServlet.doDispatch(DispatcherServlet.java:1072)
  559. at org.springframework.web.servlet.DispatcherServlet.doService(DispatcherServlet.java:965)
  560. at org.springframework.web.servlet.FrameworkServlet.processRequest(FrameworkServlet.java:1006)
  561. at org.springframework.web.servlet.FrameworkServlet.doGet(FrameworkServlet.java:898)
  562. at javax.servlet.http.HttpServlet.service(HttpServlet.java:529)
  563. at org.springframework.web.servlet.FrameworkServlet.service(FrameworkServlet.java:883)
  564. at org.springframework.test.web.servlet.TestDispatcherServlet.service(TestDispatcherServlet.java:72)
  565. at javax.servlet.http.HttpServlet.service(HttpServlet.java:623)
  566. at org.springframework.mock.web.MockFilterChain$ServletFilterProxy.doFilter(MockFilterChain.java:167)
  567. at org.springframework.mock.web.MockFilterChain.doFilter(MockFilterChain.java:134)
  568. at org.springframework.test.web.servlet.MockMvc.perform(MockMvc.java:201)
  569. at com.zksy.web.controller.cockpit.CockpitFacilityGeometryControllerTest.sourceFailureReturns500AndStableCategoryRatherThanSuccess(CockpitFacilityGeometryControllerTest.java:88)
  570. at java.base/jdk.internal.reflect.NativeMethodAccessorImpl.invoke0(Native Method)
  571. at java.base/jdk.internal.reflect.NativeMethodAccessorImpl.invoke(NativeMethodAccessorImpl.java:77)
  572. at java.base/jdk.internal.reflect.DelegatingMethodAccessorImpl.invoke(DelegatingMethodAccessorImpl.java:43)
  573. at java.base/java.lang.reflect.Method.invoke(Method.java:568)
  574. at org.junit.platform.commons.util.ReflectionUtils.invokeMethod(ReflectionUtils.java:688)
  575. at org.junit.jupiter.engine.execution.MethodInvocation.proceed(MethodInvocation.java:60)
  576. at org.junit.jupiter.engine.execution.InvocationInterceptorChain$ValidatingInvocation.proceed(InvocationInterceptorChain.java:131)
  577. at org.junit.jupiter.engine.extension.TimeoutExtension.intercept(TimeoutExtension.java:149)
  578. at org.junit.jupiter.engine.extension.TimeoutExtension.interceptTestableMethod(TimeoutExtension.java:140)
  579. at org.junit.jupiter.engine.extension.TimeoutExtension.interceptTestMethod(TimeoutExtension.java:84)
  580. at org.junit.jupiter.engine.execution.ExecutableInvoker$ReflectiveInterceptorCall.lambda$ofVoidMethod$0(ExecutableInvoker.java:115)
  581. at org.junit.jupiter.engine.execution.ExecutableInvoker.lambda$invoke$0(ExecutableInvoker.java:105)
  582. at org.junit.jupiter.engine.execution.InvocationInterceptorChain$InterceptedInvocation.proceed(InvocationInterceptorChain.java:106)
  583. at org.junit.jupiter.engine.execution.InvocationInterceptorChain.proceed(InvocationInterceptorChain.java:64)
  584. at org.junit.jupiter.engine.execution.InvocationInterceptorChain.chainAndInvoke(InvocationInterceptorChain.java:45)
  585. at org.junit.jupiter.engine.execution.InvocationInterceptorChain.invoke(InvocationInterceptorChain.java:37)
  586. at org.junit.jupiter.engine.execution.ExecutableInvoker.invoke(ExecutableInvoker.java:104)
  587. at org.junit.jupiter.engine.execution.ExecutableInvoker.invoke(ExecutableInvoker.java:98)
  588. at org.junit.jupiter.engine.descriptor.TestMethodTestDescriptor.lambda$invokeTestMethod$6(TestMethodTestDescriptor.java:210)
  589. at org.junit.platform.engine.support.hierarchical.ThrowableCollector.execute(ThrowableCollector.java:73)
  590. at org.junit.jupiter.engine.descriptor.TestMethodTestDescriptor.invokeTestMethod(TestMethodTestDescriptor.java:206)
  591. at org.junit.jupiter.engine.descriptor.TestMethodTestDescriptor.execute(TestMethodTestDescriptor.java:131)
  592. at org.junit.jupiter.engine.descriptor.TestMethodTestDescriptor.execute(TestMethodTestDescriptor.java:65)
  593. at org.junit.platform.engine.support.hierarchical.NodeTestTask.lambda$executeRecursively$5(NodeTestTask.java:139)
  594. at org.junit.platform.engine.support.hierarchical.ThrowableCollector.execute(ThrowableCollector.java:73)
  595. at org.junit.platform.engine.support.hierarchical.NodeTestTask.lambda$executeRecursively$7(NodeTestTask.java:129)
  596. at org.junit.platform.engine.support.hierarchical.Node.around(Node.java:137)
  597. at org.junit.platform.engine.support.hierarchical.NodeTestTask.lambda$executeRecursively$8(NodeTestTask.java:127)
  598. at org.junit.platform.engine.support.hierarchical.ThrowableCollector.execute(ThrowableCollector.java:73)
  599. at org.junit.platform.engine.support.hierarchical.NodeTestTask.executeRecursively(NodeTestTask.java:126)
  600. at org.junit.platform.engine.support.hierarchical.NodeTestTask.execute(NodeTestTask.java:84)
  601. at java.base/java.util.ArrayList.forEach(ArrayList.java:1511)
  602. at org.junit.platform.engine.support.hierarchical.SameThreadHierarchicalTestExecutorService.invokeAll(SameThreadHierarchicalTestExecutorService.java:38)
  603. at org.junit.platform.engine.support.hierarchical.NodeTestTask.lambda$executeRecursively$5(NodeTestTask.java:143)
  604. at org.junit.platform.engine.support.hierarchical.ThrowableCollector.execute(ThrowableCollector.java:73)
  605. at org.junit.platform.engine.support.hierarchical.NodeTestTask.lambda$executeRecursively$7(NodeTestTask.java:129)
  606. at org.junit.platform.engine.support.hierarchical.Node.around(Node.java:137)
  607. at org.junit.platform.engine.support.hierarchical.NodeTestTask.lambda$executeRecursively$8(NodeTestTask.java:127)
  608. at org.junit.platform.engine.support.hierarchical.ThrowableCollector.execute(ThrowableCollector.java:73)
  609. at org.junit.platform.engine.support.hierarchical.NodeTestTask.executeRecursively(NodeTestTask.java:126)
  610. at org.junit.platform.engine.support.hierarchical.NodeTestTask.execute(NodeTestTask.java:84)
  611. at java.base/java.util.ArrayList.forEach(ArrayList.java:1511)
  612. at org.junit.platform.engine.support.hierarchical.SameThreadHierarchicalTestExecutorService.invokeAll(SameThreadHierarchicalTestExecutorService.java:38)
  613. at org.junit.platform.engine.support.hierarchical.NodeTestTask.lambda$executeRecursively$5(NodeTestTask.java:143)
  614. at org.junit.platform.engine.support.hierarchical.ThrowableCollector.execute(ThrowableCollector.java:73)
  615. at org.junit.platform.engine.support.hierarchical.NodeTestTask.lambda$executeRecursively$7(NodeTestTask.java:129)
  616. at org.junit.platform.engine.support.hierarchical.Node.around(Node.java:137)
  617. at org.junit.platform.engine.support.hierarchical.NodeTestTask.lambda$executeRecursively$8(NodeTestTask.java:127)
  618. at org.junit.platform.engine.support.hierarchical.ThrowableCollector.execute(ThrowableCollector.java:73)
  619. at org.junit.platform.engine.support.hierarchical.NodeTestTask.executeRecursively(NodeTestTask.java:126)
  620. at org.junit.platform.engine.support.hierarchical.NodeTestTask.execute(NodeTestTask.java:84)
  621. at org.junit.platform.engine.support.hierarchical.SameThreadHierarchicalTestExecutorService.submit(SameThreadHierarchicalTestExecutorService.java:32)
  622. at org.junit.platform.engine.support.hierarchical.HierarchicalTestExecutor.execute(HierarchicalTestExecutor.java:57)
  623. at org.junit.platform.engine.support.hierarchical.HierarchicalTestEngine.execute(HierarchicalTestEngine.java:51)
  624. at org.junit.platform.launcher.core.DefaultLauncher.execute(DefaultLauncher.java:220)
  625. at org.junit.platform.launcher.core.DefaultLauncher.lambda$execute$6(DefaultLauncher.java:188)
  626. at org.junit.platform.launcher.core.DefaultLauncher.withInterceptedStreams(DefaultLauncher.java:202)
  627. at org.junit.platform.launcher.core.DefaultLauncher.execute(DefaultLauncher.java:181)
  628. at org.junit.platform.launcher.core.DefaultLauncher.execute(DefaultLauncher.java:128)
  629. at org.apache.maven.surefire.junitplatform.JUnitPlatformProvider.invokeAllTests(JUnitPlatformProvider.java:150)
  630. at org.apache.maven.surefire.junitplatform.JUnitPlatformProvider.invoke(JUnitPlatformProvider.java:124)
  631. at org.apache.maven.surefire.booter.ForkedBooter.invokeProviderInSameClassLoader(ForkedBooter.java:384)
  632. at org.apache.maven.surefire.booter.ForkedBooter.runSuitesInProcess(ForkedBooter.java:345)
  633. at org.apache.maven.surefire.booter.ForkedBooter.execute(ForkedBooter.java:126)
  634. at org.apache.maven.surefire.booter.ForkedBooter.main(ForkedBooter.java:418)
  635. 15:42:40.357 [main] DEBUG org.springframework.web.servlet.mvc.method.annotation.HttpEntityMethodProcessor - Using 'application/json', given [*/*] and supported [application/json, application/*+json]
  636. 15:42:40.357 [main] DEBUG org.springframework.web.servlet.mvc.method.annotation.HttpEntityMethodProcessor - Writing [{msg=facility geometry source unavailable, code=500, data=com.zksy.cockpit.foundation.CockpitErrorPa (truncated)...]
  637. 15:42:40.358 [main] DEBUG org.springframework.web.servlet.mvc.method.annotation.ExceptionHandlerExceptionResolver - Resolved [com.zksy.cockpit.foundation.CockpitReadException: private database details]
  638. 15:42:40.358 [main] DEBUG org.springframework.test.web.servlet.TestDispatcherServlet - Completed 500 INTERNAL_SERVER_ERROR
  639. 15:42:40.359 [main] DEBUG com.jayway.jsonpath.internal.path.CompiledPath - Evaluating path: $['code']
  640. 15:42:40.359 [main] DEBUG com.jayway.jsonpath.internal.path.CompiledPath - Evaluating path: $['data']['category']
  641. 15:42:40.359 [main] DEBUG com.jayway.jsonpath.internal.path.CompiledPath - Evaluating path: $['data']['message']
  642. 15:42:40.359 [main] DEBUG com.jayway.jsonpath.internal.path.CompiledPath - Evaluating path: $['data']['requestId']
  643. [INFO] Tests run: 6, Failures: 0, Errors: 0, Skipped: 0, Time elapsed: 1.627 s - in com.zksy.web.controller.cockpit.CockpitFacilityGeometryControllerTest
  644. [INFO] Running com.zksy.web.controller.cockpit.CockpitFacilityGeometryServiceTest
  645. 15:42:40.450 [main] ERROR com.zksy.cockpit.geometry.CockpitFacilityGeometryService - Facility geometry source read failed
  646. java.lang.IllegalStateException: private database detail
  647. at com.zksy.cockpit.geometry.CockpitFacilityGeometryService.load(CockpitFacilityGeometryService.java:60)
  648. at org.junit.jupiter.api.AssertThrows.assertThrows(AssertThrows.java:55)
  649. at org.junit.jupiter.api.AssertThrows.assertThrows(AssertThrows.java:37)
  650. at org.junit.jupiter.api.Assertions.assertThrows(Assertions.java:3007)
  651. at com.zksy.web.controller.cockpit.CockpitFacilityGeometryServiceTest.aFailedSourceNeverProducesAnEmptyOrPartialSuccess(CockpitFacilityGeometryServiceTest.java:231)
  652. at java.base/jdk.internal.reflect.NativeMethodAccessorImpl.invoke0(Native Method)
  653. at java.base/jdk.internal.reflect.NativeMethodAccessorImpl.invoke(NativeMethodAccessorImpl.java:77)
  654. at java.base/jdk.internal.reflect.DelegatingMethodAccessorImpl.invoke(DelegatingMethodAccessorImpl.java:43)
  655. at java.base/java.lang.reflect.Method.invoke(Method.java:568)
  656. at org.junit.platform.commons.util.ReflectionUtils.invokeMethod(ReflectionUtils.java:688)
  657. at org.junit.jupiter.engine.execution.MethodInvocation.proceed(MethodInvocation.java:60)
  658. at org.junit.jupiter.engine.execution.InvocationInterceptorChain$ValidatingInvocation.proceed(InvocationInterceptorChain.java:131)
  659. at org.junit.jupiter.engine.extension.TimeoutExtension.intercept(TimeoutExtension.java:149)
  660. at org.junit.jupiter.engine.extension.TimeoutExtension.interceptTestableMethod(TimeoutExtension.java:140)
  661. at org.junit.jupiter.engine.extension.TimeoutExtension.interceptTestMethod(TimeoutExtension.java:84)
  662. at org.junit.jupiter.engine.execution.ExecutableInvoker$ReflectiveInterceptorCall.lambda$ofVoidMethod$0(ExecutableInvoker.java:115)
  663. at org.junit.jupiter.engine.execution.ExecutableInvoker.lambda$invoke$0(ExecutableInvoker.java:105)
  664. at org.junit.jupiter.engine.execution.InvocationInterceptorChain$InterceptedInvocation.proceed(InvocationInterceptorChain.java:106)
  665. at org.junit.jupiter.engine.execution.InvocationInterceptorChain.proceed(InvocationInterceptorChain.java:64)
  666. at org.junit.jupiter.engine.execution.InvocationInterceptorChain.chainAndInvoke(InvocationInterceptorChain.java:45)
  667. at org.junit.jupiter.engine.execution.InvocationInterceptorChain.invoke(InvocationInterceptorChain.java:37)
  668. at org.junit.jupiter.engine.execution.ExecutableInvoker.invoke(ExecutableInvoker.java:104)
  669. at org.junit.jupiter.engine.execution.ExecutableInvoker.invoke(ExecutableInvoker.java:98)
  670. at org.junit.jupiter.engine.descriptor.TestMethodTestDescriptor.lambda$invokeTestMethod$6(TestMethodTestDescriptor.java:210)
  671. at org.junit.platform.engine.support.hierarchical.ThrowableCollector.execute(ThrowableCollector.java:73)
  672. at org.junit.jupiter.engine.descriptor.TestMethodTestDescriptor.invokeTestMethod(TestMethodTestDescriptor.java:206)
  673. at org.junit.jupiter.engine.descriptor.TestMethodTestDescriptor.execute(TestMethodTestDescriptor.java:131)
  674. at org.junit.jupiter.engine.descriptor.TestMethodTestDescriptor.execute(TestMethodTestDescriptor.java:65)
  675. at org.junit.platform.engine.support.hierarchical.NodeTestTask.lambda$executeRecursively$5(NodeTestTask.java:139)
  676. at org.junit.platform.engine.support.hierarchical.ThrowableCollector.execute(ThrowableCollector.java:73)
  677. at org.junit.platform.engine.support.hierarchical.NodeTestTask.lambda$executeRecursively$7(NodeTestTask.java:129)
  678. at org.junit.platform.engine.support.hierarchical.Node.around(Node.java:137)
  679. at org.junit.platform.engine.support.hierarchical.NodeTestTask.lambda$executeRecursively$8(NodeTestTask.java:127)
  680. at org.junit.platform.engine.support.hierarchical.ThrowableCollector.execute(ThrowableCollector.java:73)
  681. at org.junit.platform.engine.support.hierarchical.NodeTestTask.executeRecursively(NodeTestTask.java:126)
  682. at org.junit.platform.engine.support.hierarchical.NodeTestTask.execute(NodeTestTask.java:84)
  683. at java.base/java.util.ArrayList.forEach(ArrayList.java:1511)
  684. at org.junit.platform.engine.support.hierarchical.SameThreadHierarchicalTestExecutorService.invokeAll(SameThreadHierarchicalTestExecutorService.java:38)
  685. at org.junit.platform.engine.support.hierarchical.NodeTestTask.lambda$executeRecursively$5(NodeTestTask.java:143)
  686. at org.junit.platform.engine.support.hierarchical.ThrowableCollector.execute(ThrowableCollector.java:73)
  687. at org.junit.platform.engine.support.hierarchical.NodeTestTask.lambda$executeRecursively$7(NodeTestTask.java:129)
  688. at org.junit.platform.engine.support.hierarchical.Node.around(Node.java:137)
  689. at org.junit.platform.engine.support.hierarchical.NodeTestTask.lambda$executeRecursively$8(NodeTestTask.java:127)
  690. at org.junit.platform.engine.support.hierarchical.ThrowableCollector.execute(ThrowableCollector.java:73)
  691. at org.junit.platform.engine.support.hierarchical.NodeTestTask.executeRecursively(NodeTestTask.java:126)
  692. at org.junit.platform.engine.support.hierarchical.NodeTestTask.execute(NodeTestTask.java:84)
  693. at java.base/java.util.ArrayList.forEach(ArrayList.java:1511)
  694. at org.junit.platform.engine.support.hierarchical.SameThreadHierarchicalTestExecutorService.invokeAll(SameThreadHierarchicalTestExecutorService.java:38)
  695. at org.junit.platform.engine.support.hierarchical.NodeTestTask.lambda$executeRecursively$5(NodeTestTask.java:143)
  696. at org.junit.platform.engine.support.hierarchical.ThrowableCollector.execute(ThrowableCollector.java:73)
  697. at org.junit.platform.engine.support.hierarchical.NodeTestTask.lambda$executeRecursively$7(NodeTestTask.java:129)
  698. at org.junit.platform.engine.support.hierarchical.Node.around(Node.java:137)
  699. at org.junit.platform.engine.support.hierarchical.NodeTestTask.lambda$executeRecursively$8(NodeTestTask.java:127)
  700. at org.junit.platform.engine.support.hierarchical.ThrowableCollector.execute(ThrowableCollector.java:73)
  701. at org.junit.platform.engine.support.hierarchical.NodeTestTask.executeRecursively(NodeTestTask.java:126)
  702. at org.junit.platform.engine.support.hierarchical.NodeTestTask.execute(NodeTestTask.java:84)
  703. at org.junit.platform.engine.support.hierarchical.SameThreadHierarchicalTestExecutorService.submit(SameThreadHierarchicalTestExecutorService.java:32)
  704. at org.junit.platform.engine.support.hierarchical.HierarchicalTestExecutor.execute(HierarchicalTestExecutor.java:57)
  705. at org.junit.platform.engine.support.hierarchical.HierarchicalTestEngine.execute(HierarchicalTestEngine.java:51)
  706. at org.junit.platform.launcher.core.DefaultLauncher.execute(DefaultLauncher.java:220)
  707. at org.junit.platform.launcher.core.DefaultLauncher.lambda$execute$6(DefaultLauncher.java:188)
  708. at org.junit.platform.launcher.core.DefaultLauncher.withInterceptedStreams(DefaultLauncher.java:202)
  709. at org.junit.platform.launcher.core.DefaultLauncher.execute(DefaultLauncher.java:181)
  710. at org.junit.platform.launcher.core.DefaultLauncher.execute(DefaultLauncher.java:128)
  711. at org.apache.maven.surefire.junitplatform.JUnitPlatformProvider.invokeAllTests(JUnitPlatformProvider.java:150)
  712. at org.apache.maven.surefire.junitplatform.JUnitPlatformProvider.invoke(JUnitPlatformProvider.java:124)
  713. at org.apache.maven.surefire.booter.ForkedBooter.invokeProviderInSameClassLoader(ForkedBooter.java:384)
  714. at org.apache.maven.surefire.booter.ForkedBooter.runSuitesInProcess(ForkedBooter.java:345)
  715. at org.apache.maven.surefire.booter.ForkedBooter.execute(ForkedBooter.java:126)
  716. at org.apache.maven.surefire.booter.ForkedBooter.main(ForkedBooter.java:418)
  717. 15:42:40.456 [main] ERROR com.zksy.cockpit.geometry.CockpitFacilityGeometryService - Facility geometry source read failed
  718. java.lang.NullPointerException: null
  719. at java.base/java.util.Objects.requireNonNull(Objects.java:208)
  720. at com.zksy.cockpit.geometry.CockpitFacilityGeometryService.load(CockpitFacilityGeometryService.java:66)
  721. at org.junit.jupiter.api.AssertThrows.assertThrows(AssertThrows.java:55)
  722. at org.junit.jupiter.api.AssertThrows.assertThrows(AssertThrows.java:37)
  723. at org.junit.jupiter.api.Assertions.assertThrows(Assertions.java:3007)
  724. at com.zksy.web.controller.cockpit.CockpitFacilityGeometryServiceTest.aNullSourceIsAReadFailureRatherThanASuccessfulEmptyCollection(CockpitFacilityGeometryServiceTest.java:239)
  725. at java.base/jdk.internal.reflect.NativeMethodAccessorImpl.invoke0(Native Method)
  726. at java.base/jdk.internal.reflect.NativeMethodAccessorImpl.invoke(NativeMethodAccessorImpl.java:77)
  727. at java.base/jdk.internal.reflect.DelegatingMethodAccessorImpl.invoke(DelegatingMethodAccessorImpl.java:43)
  728. at java.base/java.lang.reflect.Method.invoke(Method.java:568)
  729. at org.junit.platform.commons.util.ReflectionUtils.invokeMethod(ReflectionUtils.java:688)
  730. at org.junit.jupiter.engine.execution.MethodInvocation.proceed(MethodInvocation.java:60)
  731. at org.junit.jupiter.engine.execution.InvocationInterceptorChain$ValidatingInvocation.proceed(InvocationInterceptorChain.java:131)
  732. at org.junit.jupiter.engine.extension.TimeoutExtension.intercept(TimeoutExtension.java:149)
  733. at org.junit.jupiter.engine.extension.TimeoutExtension.interceptTestableMethod(TimeoutExtension.java:140)
  734. at org.junit.jupiter.engine.extension.TimeoutExtension.interceptTestMethod(TimeoutExtension.java:84)
  735. at org.junit.jupiter.engine.execution.ExecutableInvoker$ReflectiveInterceptorCall.lambda$ofVoidMethod$0(ExecutableInvoker.java:115)
  736. at org.junit.jupiter.engine.execution.ExecutableInvoker.lambda$invoke$0(ExecutableInvoker.java:105)
  737. at org.junit.jupiter.engine.execution.InvocationInterceptorChain$InterceptedInvocation.proceed(InvocationInterceptorChain.java:106)
  738. at org.junit.jupiter.engine.execution.InvocationInterceptorChain.proceed(InvocationInterceptorChain.java:64)
  739. at org.junit.jupiter.engine.execution.InvocationInterceptorChain.chainAndInvoke(InvocationInterceptorChain.java:45)
  740. at org.junit.jupiter.engine.execution.InvocationInterceptorChain.invoke(InvocationInterceptorChain.java:37)
  741. at org.junit.jupiter.engine.execution.ExecutableInvoker.invoke(ExecutableInvoker.java:104)
  742. at org.junit.jupiter.engine.execution.ExecutableInvoker.invoke(ExecutableInvoker.java:98)
  743. at org.junit.jupiter.engine.descriptor.TestMethodTestDescriptor.lambda$invokeTestMethod$6(TestMethodTestDescriptor.java:210)
  744. at org.junit.platform.engine.support.hierarchical.ThrowableCollector.execute(ThrowableCollector.java:73)
  745. at org.junit.jupiter.engine.descriptor.TestMethodTestDescriptor.invokeTestMethod(TestMethodTestDescriptor.java:206)
  746. at org.junit.jupiter.engine.descriptor.TestMethodTestDescriptor.execute(TestMethodTestDescriptor.java:131)
  747. at org.junit.jupiter.engine.descriptor.TestMethodTestDescriptor.execute(TestMethodTestDescriptor.java:65)
  748. at org.junit.platform.engine.support.hierarchical.NodeTestTask.lambda$executeRecursively$5(NodeTestTask.java:139)
  749. at org.junit.platform.engine.support.hierarchical.ThrowableCollector.execute(ThrowableCollector.java:73)
  750. at org.junit.platform.engine.support.hierarchical.NodeTestTask.lambda$executeRecursively$7(NodeTestTask.java:129)
  751. at org.junit.platform.engine.support.hierarchical.Node.around(Node.java:137)
  752. at org.junit.platform.engine.support.hierarchical.NodeTestTask.lambda$executeRecursively$8(NodeTestTask.java:127)
  753. at org.junit.platform.engine.support.hierarchical.ThrowableCollector.execute(ThrowableCollector.java:73)
  754. at org.junit.platform.engine.support.hierarchical.NodeTestTask.executeRecursively(NodeTestTask.java:126)
  755. at org.junit.platform.engine.support.hierarchical.NodeTestTask.execute(NodeTestTask.java:84)
  756. at java.base/java.util.ArrayList.forEach(ArrayList.java:1511)
  757. at org.junit.platform.engine.support.hierarchical.SameThreadHierarchicalTestExecutorService.invokeAll(SameThreadHierarchicalTestExecutorService.java:38)
  758. at org.junit.platform.engine.support.hierarchical.NodeTestTask.lambda$executeRecursively$5(NodeTestTask.java:143)
  759. at org.junit.platform.engine.support.hierarchical.ThrowableCollector.execute(ThrowableCollector.java:73)
  760. at org.junit.platform.engine.support.hierarchical.NodeTestTask.lambda$executeRecursively$7(NodeTestTask.java:129)
  761. at org.junit.platform.engine.support.hierarchical.Node.around(Node.java:137)
  762. at org.junit.platform.engine.support.hierarchical.NodeTestTask.lambda$executeRecursively$8(NodeTestTask.java:127)
  763. at org.junit.platform.engine.support.hierarchical.ThrowableCollector.execute(ThrowableCollector.java:73)
  764. at org.junit.platform.engine.support.hierarchical.NodeTestTask.executeRecursively(NodeTestTask.java:126)
  765. at org.junit.platform.engine.support.hierarchical.NodeTestTask.execute(NodeTestTask.java:84)
  766. at java.base/java.util.ArrayList.forEach(ArrayList.java:1511)
  767. at org.junit.platform.engine.support.hierarchical.SameThreadHierarchicalTestExecutorService.invokeAll(SameThreadHierarchicalTestExecutorService.java:38)
  768. at org.junit.platform.engine.support.hierarchical.NodeTestTask.lambda$executeRecursively$5(NodeTestTask.java:143)
  769. at org.junit.platform.engine.support.hierarchical.ThrowableCollector.execute(ThrowableCollector.java:73)
  770. at org.junit.platform.engine.support.hierarchical.NodeTestTask.lambda$executeRecursively$7(NodeTestTask.java:129)
  771. at org.junit.platform.engine.support.hierarchical.Node.around(Node.java:137)
  772. at org.junit.platform.engine.support.hierarchical.NodeTestTask.lambda$executeRecursively$8(NodeTestTask.java:127)
  773. at org.junit.platform.engine.support.hierarchical.ThrowableCollector.execute(ThrowableCollector.java:73)
  774. at org.junit.platform.engine.support.hierarchical.NodeTestTask.executeRecursively(NodeTestTask.java:126)
  775. at org.junit.platform.engine.support.hierarchical.NodeTestTask.execute(NodeTestTask.java:84)
  776. at org.junit.platform.engine.support.hierarchical.SameThreadHierarchicalTestExecutorService.submit(SameThreadHierarchicalTestExecutorService.java:32)
  777. at org.junit.platform.engine.support.hierarchical.HierarchicalTestExecutor.execute(HierarchicalTestExecutor.java:57)
  778. at org.junit.platform.engine.support.hierarchical.HierarchicalTestEngine.execute(HierarchicalTestEngine.java:51)
  779. at org.junit.platform.launcher.core.DefaultLauncher.execute(DefaultLauncher.java:220)
  780. at org.junit.platform.launcher.core.DefaultLauncher.lambda$execute$6(DefaultLauncher.java:188)
  781. at org.junit.platform.launcher.core.DefaultLauncher.withInterceptedStreams(DefaultLauncher.java:202)
  782. at org.junit.platform.launcher.core.DefaultLauncher.execute(DefaultLauncher.java:181)
  783. at org.junit.platform.launcher.core.DefaultLauncher.execute(DefaultLauncher.java:128)
  784. at org.apache.maven.surefire.junitplatform.JUnitPlatformProvider.invokeAllTests(JUnitPlatformProvider.java:150)
  785. at org.apache.maven.surefire.junitplatform.JUnitPlatformProvider.invoke(JUnitPlatformProvider.java:124)
  786. at org.apache.maven.surefire.booter.ForkedBooter.invokeProviderInSameClassLoader(ForkedBooter.java:384)
  787. at org.apache.maven.surefire.booter.ForkedBooter.runSuitesInProcess(ForkedBooter.java:345)
  788. at org.apache.maven.surefire.booter.ForkedBooter.execute(ForkedBooter.java:126)
  789. at org.apache.maven.surefire.booter.ForkedBooter.main(ForkedBooter.java:418)
  790. [INFO] Tests run: 15, Failures: 0, Errors: 0, Skipped: 0, Time elapsed: 0.094 s - in com.zksy.web.controller.cockpit.CockpitFacilityGeometryServiceTest
  791. [INFO]
  792. [INFO] Results:
  793. [INFO]
  794. [INFO] Tests run: 21, Failures: 0, Errors: 0, Skipped: 0
  795. [INFO]
  796. [INFO] ------------------------------------------------------------------------
  797. [INFO] Reactor Summary:
  798. [INFO]
  799. [INFO] pipe-ner-server 1.0.0 .............................. SUCCESS [ 0.001 s]
  800. [INFO] pipe-network-service 3.9.0 ......................... SUCCESS [ 0.001 s]
  801. [INFO] zksy-common 3.9.0 .................................. SUCCESS [ 1.072 s]
  802. [INFO] zksy-system 3.9.0 .................................. SUCCESS [ 0.293 s]
  803. [INFO] zksy-framework 3.9.0 ............................... SUCCESS [ 0.130 s]
  804. [INFO] zksy-quartz 3.9.0 .................................. SUCCESS [ 1.500 s]
  805. [INFO] zksy-generator 3.9.0 ............................... SUCCESS [ 0.061 s]
  806. [INFO] zksy-admin 3.9.0 ................................... SUCCESS [ 10.898 s]
  807. [INFO] ------------------------------------------------------------------------
  808. [INFO] BUILD SUCCESS
  809. [INFO] ------------------------------------------------------------------------
  810. [INFO] Total time: 14.337 s
  811. [INFO] Finished at: 2026-10-13T15:42:40+08:00
  812. [INFO] ------------------------------------------------------------------------