network-level-red.log 93 KB

123456789101112131415161718192021222324252627282930313233343536373839404142434445464748495051525354555657585960616263646566676869707172737475767778798081828384858687888990919293949596979899100101102103104105106107108109110111112113114115116117118119120121122123124125126127128129130131132133134135136137138139140141142143144145146147148149150151152153154155156157158159160161162163164165166167168169170171172173174175176177178179180181182183184185186187188189190191192193194195196197198199200201202203204205206207208209210211212213214215216217218219220221222223224225226227228229230231232233234235236237238239240241242243244245246247248249250251252253254255256257258259260261262263264265266267268269270271272273274275276277278279280281282283284285286287288289290291292293294295296297298299300301302303304305306307308309310311312313314315316317318319320321322323324325326327328329330331332333334335336337338339340341342343344345346347348349350351352353354355356357358359360361362363364365366367368369370371372373374375376377378379380381382383384385386387388389390391392393394395396397398399400401402403404405406407408409410411412413414415416417418419420421422423424425426427428429430431432433434435436437438439440441442443444445446447448449450451452453454455456457458459460461462463464465466467468469470471472473474475476477478479480481482483484485486487488489490491492493494495496497498499500501502503504505506507508509510511512513514515516517518519520521522523524525526527528529530531532533534535536537538539540541542543544545546547548549550551552553554555556557558559560561562563564565566567568569570571572573574575576577578579580581582583584585586587588589590591592593594595596597598599600601602603604605606607608609610611612613614615616617618619620621622623624625626627628629630631632633634635636637638639640641642643644645646647648649650651652653654655656657658659660661662663664665666667668669670671672673674675676677678679680681682683684685686687688689690691692693694695696697698699700701702703704705706707708709710711712713714715716717718719720721722723724725726727728729730731732733734735736737738739740741742743744745746747748749750751752753754755756757758759760761762763764765766767768769770771772773774775776777778779780781782783784785786787788789790791792793794795796797798799800801802803804805806807808809810811812813814815816817818819820821822823824825826827828829830831832833834835836837838839840841
  1. [INFO] Scanning for projects...
  2. [INFO] ------------------------------------------------------------------------
  3. [INFO] Reactor Build Order:
  4. [INFO]
  5. [INFO] pipe-ner-server [pom]
  6. [INFO] pipe-network-service [pom]
  7. [INFO] zksy-common [jar]
  8. [INFO] zksy-system [jar]
  9. [INFO] zksy-framework [jar]
  10. [INFO] zksy-quartz [jar]
  11. [INFO] zksy-generator [jar]
  12. [INFO] zksy-admin [jar]
  13. [INFO]
  14. [INFO] ----------------------< com.zksy:pipe-ner-server >----------------------
  15. [INFO] Building pipe-ner-server 1.0.0 [1/8]
  16. [INFO] from pom.xml
  17. [INFO] --------------------------------[ pom ]---------------------------------
  18. [INFO]
  19. [INFO] -------------------< com.zksy:pipe-network-service >--------------------
  20. [INFO] Building pipe-network-service 3.9.0 [2/8]
  21. [INFO] from pipe-network-service\pom.xml
  22. [INFO] --------------------------------[ pom ]---------------------------------
  23. [INFO]
  24. [INFO] ------------------------< com.zksy:zksy-common >------------------------
  25. [INFO] Building zksy-common 3.9.0 [3/8]
  26. [INFO] from pipe-network-service\zksy-common\pom.xml
  27. [INFO] --------------------------------[ jar ]---------------------------------
  28. [WARNING] Parameter 'parameters' is unknown for plugin 'maven-compiler-plugin:3.1:compile (default-compile)'
  29. [WARNING] Parameter 'parameters' is unknown for plugin 'maven-compiler-plugin:3.1:testCompile (default-testCompile)'
  30. [INFO]
  31. [INFO] --- resources:3.2.0:resources (default-resources) @ zksy-common ---
  32. [INFO] Using 'UTF-8' encoding to copy filtered resources.
  33. [INFO] Using 'UTF-8' encoding to copy filtered properties files.
  34. [INFO] skip non existing resourceDirectory E:\pipe-ner-server\pipe-network-service\zksy-common\src\main\resources
  35. [INFO] skip non existing resourceDirectory E:\pipe-ner-server\pipe-network-service\zksy-common\src\main\resources
  36. [INFO]
  37. [INFO] --- compiler:3.1:compile (default-compile) @ zksy-common ---
  38. [INFO] Nothing to compile - all classes are up to date
  39. [INFO]
  40. [INFO] --- resources:3.2.0:testResources (default-testResources) @ zksy-common ---
  41. [INFO] Using 'UTF-8' encoding to copy filtered resources.
  42. [INFO] Using 'UTF-8' encoding to copy filtered properties files.
  43. [INFO] skip non existing resourceDirectory E:\pipe-ner-server\pipe-network-service\zksy-common\src\test\resources
  44. [INFO]
  45. [INFO] --- compiler:3.1:testCompile (default-testCompile) @ zksy-common ---
  46. [INFO] No sources to compile
  47. [INFO]
  48. [INFO] --- surefire:2.22.2:test (default-test) @ zksy-common ---
  49. [INFO] No tests to run.
  50. [INFO]
  51. [INFO] ------------------------< com.zksy:zksy-system >------------------------
  52. [INFO] Building zksy-system 3.9.0 [4/8]
  53. [INFO] from pipe-network-service\zksy-system\pom.xml
  54. [INFO] --------------------------------[ jar ]---------------------------------
  55. [WARNING] Parameter 'parameters' is unknown for plugin 'maven-compiler-plugin:3.1:compile (default-compile)'
  56. [WARNING] Parameter 'parameters' is unknown for plugin 'maven-compiler-plugin:3.1:testCompile (default-testCompile)'
  57. [INFO]
  58. [INFO] --- resources:3.2.0:resources (default-resources) @ zksy-system ---
  59. [INFO] Using 'UTF-8' encoding to copy filtered resources.
  60. [INFO] Using 'UTF-8' encoding to copy filtered properties files.
  61. [INFO] Copying 0 resource
  62. [INFO] Copying 46 resources
  63. [INFO]
  64. [INFO] --- compiler:3.1:compile (default-compile) @ zksy-system ---
  65. [INFO] Changes detected - recompiling the module!
  66. [INFO] Compiling 761 source files to E:\pipe-ner-server\pipe-network-service\zksy-system\target\classes
  67. [WARNING] /E:/pipe-ner-server/pipe-network-service/zksy-system/src/main/java/com/zksy/base/video/VideoCollectorClient.java: E:\pipe-ner-server\pipe-network-service\zksy-system\src\main\java\com\zksy\base\video\VideoCollectorClient.java使用了未经检查或不安全的操作。
  68. [WARNING] /E:/pipe-ner-server/pipe-network-service/zksy-system/src/main/java/com/zksy/base/video/VideoCollectorClient.java: 有关详细信息, 请使用 -Xlint:unchecked 重新编译。
  69. [INFO]
  70. [INFO] --- resources:3.2.0:testResources (default-testResources) @ zksy-system ---
  71. [INFO] Using 'UTF-8' encoding to copy filtered resources.
  72. [INFO] Using 'UTF-8' encoding to copy filtered properties files.
  73. [INFO] skip non existing resourceDirectory E:\pipe-ner-server\pipe-network-service\zksy-system\src\test\resources
  74. [INFO]
  75. [INFO] --- compiler:3.1:testCompile (default-testCompile) @ zksy-system ---
  76. [INFO] Changes detected - recompiling the module!
  77. [INFO] Compiling 30 source files to E:\pipe-ner-server\pipe-network-service\zksy-system\target\test-classes
  78. [WARNING] /E:/pipe-ner-server/pipe-network-service/zksy-system/src/test/java/com/zksy/base/alarm/service/AlarmLifecycleServiceTest.java: E:\pipe-ner-server\pipe-network-service\zksy-system\src\test\java\com\zksy\base\alarm\service\AlarmLifecycleServiceTest.java使用或覆盖了已过时的 API。
  79. [WARNING] /E:/pipe-ner-server/pipe-network-service/zksy-system/src/test/java/com/zksy/base/alarm/service/AlarmLifecycleServiceTest.java: 有关详细信息, 请使用 -Xlint:deprecation 重新编译。
  80. [WARNING] /E:/pipe-ner-server/pipe-network-service/zksy-system/src/test/java/com/zksy/ops/service/impl/WorkOrderServiceImplTest.java: 某些输入文件使用了未经检查或不安全的操作。
  81. [WARNING] /E:/pipe-ner-server/pipe-network-service/zksy-system/src/test/java/com/zksy/ops/service/impl/WorkOrderServiceImplTest.java: 有关详细信息, 请使用 -Xlint:unchecked 重新编译。
  82. [INFO]
  83. [INFO] --- surefire:2.22.2:test (default-test) @ zksy-system ---
  84. [INFO]
  85. [INFO] ----------------------< com.zksy:zksy-framework >-----------------------
  86. [INFO] Building zksy-framework 3.9.0 [5/8]
  87. [INFO] from pipe-network-service\zksy-framework\pom.xml
  88. [INFO] --------------------------------[ jar ]---------------------------------
  89. [WARNING] Parameter 'parameters' is unknown for plugin 'maven-compiler-plugin:3.1:compile (default-compile)'
  90. [WARNING] Parameter 'parameters' is unknown for plugin 'maven-compiler-plugin:3.1:testCompile (default-testCompile)'
  91. [INFO]
  92. [INFO] --- resources:3.2.0:resources (default-resources) @ zksy-framework ---
  93. [INFO] Using 'UTF-8' encoding to copy filtered resources.
  94. [INFO] Using 'UTF-8' encoding to copy filtered properties files.
  95. [INFO] skip non existing resourceDirectory E:\pipe-ner-server\pipe-network-service\zksy-framework\src\main\resources
  96. [INFO] skip non existing resourceDirectory E:\pipe-ner-server\pipe-network-service\zksy-framework\src\main\resources
  97. [INFO]
  98. [INFO] --- compiler:3.1:compile (default-compile) @ zksy-framework ---
  99. [INFO] Nothing to compile - all classes are up to date
  100. [INFO]
  101. [INFO] --- resources:3.2.0:testResources (default-testResources) @ zksy-framework ---
  102. [INFO] Using 'UTF-8' encoding to copy filtered resources.
  103. [INFO] Using 'UTF-8' encoding to copy filtered properties files.
  104. [INFO] skip non existing resourceDirectory E:\pipe-ner-server\pipe-network-service\zksy-framework\src\test\resources
  105. [INFO]
  106. [INFO] --- compiler:3.1:testCompile (default-testCompile) @ zksy-framework ---
  107. [INFO] No sources to compile
  108. [INFO]
  109. [INFO] --- surefire:2.22.2:test (default-test) @ zksy-framework ---
  110. [INFO] No tests to run.
  111. [INFO]
  112. [INFO] ------------------------< com.zksy:zksy-quartz >------------------------
  113. [INFO] Building zksy-quartz 3.9.0 [6/8]
  114. [INFO] from pipe-network-service\zksy-quartz\pom.xml
  115. [INFO] --------------------------------[ jar ]---------------------------------
  116. [WARNING] Parameter 'parameters' is unknown for plugin 'maven-compiler-plugin:3.1:compile (default-compile)'
  117. [WARNING] Parameter 'parameters' is unknown for plugin 'maven-compiler-plugin:3.1:testCompile (default-testCompile)'
  118. [INFO]
  119. [INFO] --- resources:3.2.0:resources (default-resources) @ zksy-quartz ---
  120. [INFO] Using 'UTF-8' encoding to copy filtered resources.
  121. [INFO] Using 'UTF-8' encoding to copy filtered properties files.
  122. [INFO] Copying 0 resource
  123. [INFO] Copying 2 resources
  124. [INFO]
  125. [INFO] --- compiler:3.1:compile (default-compile) @ zksy-quartz ---
  126. [INFO] Changes detected - recompiling the module!
  127. [INFO] Compiling 18 source files to E:\pipe-ner-server\pipe-network-service\zksy-quartz\target\classes
  128. [INFO]
  129. [INFO] --- resources:3.2.0:testResources (default-testResources) @ zksy-quartz ---
  130. [INFO] Using 'UTF-8' encoding to copy filtered resources.
  131. [INFO] Using 'UTF-8' encoding to copy filtered properties files.
  132. [INFO] skip non existing resourceDirectory E:\pipe-ner-server\pipe-network-service\zksy-quartz\src\test\resources
  133. [INFO]
  134. [INFO] --- compiler:3.1:testCompile (default-testCompile) @ zksy-quartz ---
  135. [INFO] No sources to compile
  136. [INFO]
  137. [INFO] --- surefire:2.22.2:test (default-test) @ zksy-quartz ---
  138. [INFO] No tests to run.
  139. [INFO]
  140. [INFO] ----------------------< com.zksy:zksy-generator >-----------------------
  141. [INFO] Building zksy-generator 3.9.0 [7/8]
  142. [INFO] from pipe-network-service\zksy-generator\pom.xml
  143. [INFO] --------------------------------[ jar ]---------------------------------
  144. [WARNING] Parameter 'parameters' is unknown for plugin 'maven-compiler-plugin:3.1:compile (default-compile)'
  145. [WARNING] Parameter 'parameters' is unknown for plugin 'maven-compiler-plugin:3.1:testCompile (default-testCompile)'
  146. [INFO]
  147. [INFO] --- resources:3.2.0:resources (default-resources) @ zksy-generator ---
  148. [INFO] Using 'UTF-8' encoding to copy filtered resources.
  149. [INFO] Using 'UTF-8' encoding to copy filtered properties files.
  150. [INFO] Copying 0 resource
  151. [INFO] Copying 16 resources
  152. [INFO]
  153. [INFO] --- compiler:3.1:compile (default-compile) @ zksy-generator ---
  154. [INFO] Nothing to compile - all classes are up to date
  155. [INFO]
  156. [INFO] --- resources:3.2.0:testResources (default-testResources) @ zksy-generator ---
  157. [INFO] Using 'UTF-8' encoding to copy filtered resources.
  158. [INFO] Using 'UTF-8' encoding to copy filtered properties files.
  159. [INFO] skip non existing resourceDirectory E:\pipe-ner-server\pipe-network-service\zksy-generator\src\test\resources
  160. [INFO]
  161. [INFO] --- compiler:3.1:testCompile (default-testCompile) @ zksy-generator ---
  162. [INFO] No sources to compile
  163. [INFO]
  164. [INFO] --- surefire:2.22.2:test (default-test) @ zksy-generator ---
  165. [INFO] No tests to run.
  166. [INFO]
  167. [INFO] ------------------------< com.zksy:zksy-admin >-------------------------
  168. [INFO] Building zksy-admin 3.9.0 [8/8]
  169. [INFO] from pipe-network-service\zksy-admin\pom.xml
  170. [INFO] --------------------------------[ jar ]---------------------------------
  171. [WARNING] Parameter 'parameters' is unknown for plugin 'maven-compiler-plugin:3.1:compile (default-compile)'
  172. [WARNING] Parameter 'parameters' is unknown for plugin 'maven-compiler-plugin:3.1:testCompile (default-testCompile)'
  173. [WARNING] 1 problem was encountered while building the effective model for org.javassist:javassist:jar:3.21.0-GA during dependency collection step for project (use -X to see details)
  174. [INFO]
  175. [INFO] --- resources:3.2.0:resources (default-resources) @ zksy-admin ---
  176. [INFO] Using 'UTF-8' encoding to copy filtered resources.
  177. [INFO] Using 'UTF-8' encoding to copy filtered properties files.
  178. [INFO] Copying 4 resources
  179. [INFO] Copying 6 resources
  180. [INFO]
  181. [INFO] --- compiler:3.1:compile (default-compile) @ zksy-admin ---
  182. [INFO] Changes detected - recompiling the module!
  183. [INFO] Compiling 146 source files to E:\pipe-ner-server\pipe-network-service\zksy-admin\target\classes
  184. [INFO]
  185. [INFO] --- resources:3.2.0:testResources (default-testResources) @ zksy-admin ---
  186. [INFO] Using 'UTF-8' encoding to copy filtered resources.
  187. [INFO] Using 'UTF-8' encoding to copy filtered properties files.
  188. [INFO] skip non existing resourceDirectory E:\pipe-ner-server\pipe-network-service\zksy-admin\src\test\resources
  189. [INFO]
  190. [INFO] --- compiler:3.1:testCompile (default-testCompile) @ zksy-admin ---
  191. [INFO] Changes detected - recompiling the module!
  192. [INFO] Compiling 67 source files to E:\pipe-ner-server\pipe-network-service\zksy-admin\target\test-classes
  193. [WARNING] /E:/pipe-ner-server/pipe-network-service/zksy-admin/src/test/java/com/zksy/web/controller/cockpit/BusinessCockpitOverviewWarningSettingsAdapterTest.java: 某些输入文件使用了未经检查或不安全的操作。
  194. [WARNING] /E:/pipe-ner-server/pipe-network-service/zksy-admin/src/test/java/com/zksy/web/controller/cockpit/BusinessCockpitOverviewWarningSettingsAdapterTest.java: 有关详细信息, 请使用 -Xlint:unchecked 重新编译。
  195. [INFO]
  196. [INFO] --- surefire:2.22.2:test (default-test) @ zksy-admin ---
  197. [INFO]
  198. [INFO] -------------------------------------------------------
  199. [INFO] T E S T S
  200. [INFO] -------------------------------------------------------
  201. [INFO] Running com.zksy.web.controller.cockpit.CockpitFacilityGeometryControllerTest
  202. 16:02:56.682 [main] DEBUG org.jboss.logging - Logging Provider: org.jboss.logging.Log4j2LoggerProvider
  203. 16:02:56.685 [main] INFO org.hibernate.validator.internal.util.Version - HV000001: Hibernate Validator 6.2.5.Final
  204. 16:02:56.703 [main] DEBUG org.hibernate.validator.messageinterpolation.ResourceBundleMessageInterpolator - Loaded expression factory via original TCCL
  205. 16:02:56.703 [main] DEBUG org.hibernate.validator.internal.engine.AbstractConfigurationImpl - Setting custom MessageInterpolator of type org.springframework.validation.beanvalidation.LocaleContextMessageInterpolator
  206. 16:02:56.703 [main] DEBUG org.hibernate.validator.internal.engine.AbstractConfigurationImpl - Setting custom ParameterNameProvider of type org.springframework.validation.beanvalidation.LocalValidatorFactoryBean$1
  207. 16:02:56.708 [main] DEBUG org.hibernate.validator.internal.xml.config.ValidationXmlParser - Trying to load META-INF/validation.xml for XML based Validator configuration.
  208. 16:02:56.709 [main] DEBUG org.hibernate.validator.internal.xml.config.ResourceLoaderHelper - Trying to load META-INF/validation.xml via TCCL
  209. 16:02:56.709 [main] DEBUG org.hibernate.validator.internal.xml.config.ResourceLoaderHelper - Trying to load META-INF/validation.xml via Hibernate Validator's class loader
  210. 16:02:56.709 [main] DEBUG org.hibernate.validator.internal.xml.config.ValidationXmlParser - No META-INF/validation.xml found. Using annotation based configuration only.
  211. 16:02:56.712 [main] DEBUG org.hibernate.validator.internal.engine.resolver.TraversableResolvers - Cannot find javax.persistence.Persistence on classpath. Assuming non JPA 2 environment. All properties will per default be traversable.
  212. 16:02:56.798 [main] DEBUG org.hibernate.validator.internal.engine.ValidatorFactoryConfigurationHelper - HV000252: Using org.hibernate.validator.internal.engine.DefaultPropertyNodeNameProvider as property node name provider.
  213. 16:02:56.802 [main] DEBUG org.hibernate.validator.internal.engine.ValidatorFactoryConfigurationHelper - HV000234: Using org.springframework.validation.beanvalidation.LocaleContextMessageInterpolator as ValidatorFactory-scoped message interpolator.
  214. 16:02:56.802 [main] DEBUG org.hibernate.validator.internal.engine.ValidatorFactoryConfigurationHelper - HV000234: Using org.hibernate.validator.internal.engine.resolver.TraverseAllTraversableResolver as ValidatorFactory-scoped traversable resolver.
  215. 16:02:56.803 [main] DEBUG org.hibernate.validator.internal.engine.ValidatorFactoryConfigurationHelper - HV000234: Using org.hibernate.validator.internal.util.ExecutableParameterNameProvider as ValidatorFactory-scoped parameter name provider.
  216. 16:02:56.803 [main] DEBUG org.hibernate.validator.internal.engine.ValidatorFactoryConfigurationHelper - HV000234: Using org.hibernate.validator.internal.engine.DefaultClockProvider as ValidatorFactory-scoped clock provider.
  217. 16:02:56.803 [main] DEBUG org.hibernate.validator.internal.engine.ValidatorFactoryConfigurationHelper - HV000234: Using org.hibernate.validator.internal.engine.scripting.DefaultScriptEvaluatorFactory as ValidatorFactory-scoped script evaluator factory.
  218. 16:02:56.901 [main] DEBUG _org.springframework.web.servlet.HandlerMapping.Mappings -
  219. c.z.w.c.c.CockpitFacilityGeometryController:
  220. {GET [/api/cockpit/v1/infrastructure/geometry]}: geometry()
  221. 16:02:56.905 [main] DEBUG org.springframework.web.servlet.mvc.method.annotation.RequestMappingHandlerMapping - 1 mappings in org.springframework.web.servlet.mvc.method.annotation.RequestMappingHandlerMapping
  222. 16:02:57.124 [main] DEBUG org.springframework.web.servlet.mvc.method.annotation.RequestMappingHandlerAdapter - ControllerAdvice beans: 0 @ModelAttribute, 0 @InitBinder, 1 RequestBodyAdvice, 1 ResponseBodyAdvice
  223. 16:02:57.145 [main] DEBUG org.springframework.web.servlet.mvc.method.annotation.ExceptionHandlerExceptionResolver - ControllerAdvice beans: 0 @ExceptionHandler, 1 ResponseBodyAdvice
  224. 16:02:57.160 [main] INFO org.springframework.mock.web.MockServletContext - Initializing Spring TestDispatcherServlet ''
  225. 16:02:57.160 [main] INFO org.springframework.test.web.servlet.TestDispatcherServlet - Initializing Servlet ''
  226. 16:02:57.161 [main] DEBUG org.springframework.test.web.servlet.TestDispatcherServlet - Detected AcceptHeaderLocaleResolver
  227. 16:02:57.161 [main] DEBUG org.springframework.test.web.servlet.TestDispatcherServlet - Detected FixedThemeResolver
  228. 16:02:57.162 [main] DEBUG org.springframework.test.web.servlet.TestDispatcherServlet - Detected org.springframework.web.servlet.view.DefaultRequestToViewNameTranslator@2513a118
  229. 16:02:57.162 [main] DEBUG org.springframework.test.web.servlet.TestDispatcherServlet - Detected org.springframework.web.servlet.support.SessionFlashMapManager@2bfb583b
  230. 16:02:57.162 [main] DEBUG org.springframework.test.web.servlet.TestDispatcherServlet - enableLoggingRequestDetails='false': request parameters and headers will be masked to prevent unsafe logging of potentially sensitive data
  231. 16:02:57.162 [main] INFO org.springframework.test.web.servlet.TestDispatcherServlet - Completed initialization in 2 ms
  232. 16:02:57.407 [main] DEBUG org.springframework.test.web.servlet.TestDispatcherServlet - GET "/api/cockpit/v1/infrastructure/geometry", parameters={}
  233. 16:02:57.410 [main] DEBUG org.springframework.web.servlet.mvc.method.annotation.RequestMappingHandlerMapping - Mapped to com.zksy.web.controller.cockpit.CockpitFacilityGeometryController#geometry()
  234. 16:02:57.442 [main] DEBUG org.springframework.web.servlet.mvc.method.annotation.HttpEntityMethodProcessor - Using 'application/json', given [*/*] and supported [application/json, application/*+json]
  235. 16:02:57.442 [main] DEBUG org.springframework.web.servlet.mvc.method.annotation.HttpEntityMethodProcessor - Writing [{msg=操作成功, code=200, data=com.zksy.cockpit.geometry.CockpitFacilityGeometryResponse@39549f33}]
  236. 16:02:57.458 [main] DEBUG org.springframework.test.web.servlet.TestDispatcherServlet - Completed 200 OK
  237. 16:02:57.490 [main] DEBUG com.jayway.jsonpath.internal.path.CompiledPath - Evaluating path: $['code']
  238. 16:02:57.493 [main] DEBUG com.jayway.jsonpath.internal.path.CompiledPath - Evaluating path: $['data']['type']
  239. 16:02:57.496 [main] DEBUG com.jayway.jsonpath.internal.path.CompiledPath - Evaluating path: $['data']['features']
  240. 16:02:57.497 [main] DEBUG com.jayway.jsonpath.internal.path.CompiledPath - Evaluating path: $['data']['coverage']
  241. 16:02:57.497 [main] DEBUG com.jayway.jsonpath.internal.path.CompiledPath - Evaluating path: $['data']['coverage'][4]['state']
  242. 16:02:57.503 [main] DEBUG org.hibernate.validator.messageinterpolation.ResourceBundleMessageInterpolator - Loaded expression factory via original TCCL
  243. 16:02:57.503 [main] DEBUG org.hibernate.validator.internal.engine.AbstractConfigurationImpl - Setting custom MessageInterpolator of type org.springframework.validation.beanvalidation.LocaleContextMessageInterpolator
  244. 16:02:57.503 [main] DEBUG org.hibernate.validator.internal.engine.AbstractConfigurationImpl - Setting custom ParameterNameProvider of type org.springframework.validation.beanvalidation.LocalValidatorFactoryBean$1
  245. 16:02:57.504 [main] DEBUG org.hibernate.validator.internal.xml.config.ValidationXmlParser - Trying to load META-INF/validation.xml for XML based Validator configuration.
  246. 16:02:57.504 [main] DEBUG org.hibernate.validator.internal.xml.config.ResourceLoaderHelper - Trying to load META-INF/validation.xml via TCCL
  247. 16:02:57.504 [main] DEBUG org.hibernate.validator.internal.xml.config.ResourceLoaderHelper - Trying to load META-INF/validation.xml via Hibernate Validator's class loader
  248. 16:02:57.504 [main] DEBUG org.hibernate.validator.internal.xml.config.ValidationXmlParser - No META-INF/validation.xml found. Using annotation based configuration only.
  249. 16:02:57.505 [main] DEBUG org.hibernate.validator.internal.engine.resolver.TraversableResolvers - Cannot find javax.persistence.Persistence on classpath. Assuming non JPA 2 environment. All properties will per default be traversable.
  250. 16:02:57.507 [main] DEBUG org.hibernate.validator.internal.engine.ValidatorFactoryConfigurationHelper - HV000252: Using org.hibernate.validator.internal.engine.DefaultPropertyNodeNameProvider as property node name provider.
  251. 16:02:57.507 [main] DEBUG org.hibernate.validator.internal.engine.ValidatorFactoryConfigurationHelper - HV000234: Using org.springframework.validation.beanvalidation.LocaleContextMessageInterpolator as ValidatorFactory-scoped message interpolator.
  252. 16:02:57.507 [main] DEBUG org.hibernate.validator.internal.engine.ValidatorFactoryConfigurationHelper - HV000234: Using org.hibernate.validator.internal.engine.resolver.TraverseAllTraversableResolver as ValidatorFactory-scoped traversable resolver.
  253. 16:02:57.507 [main] DEBUG org.hibernate.validator.internal.engine.ValidatorFactoryConfigurationHelper - HV000234: Using org.hibernate.validator.internal.util.ExecutableParameterNameProvider as ValidatorFactory-scoped parameter name provider.
  254. 16:02:57.507 [main] DEBUG org.hibernate.validator.internal.engine.ValidatorFactoryConfigurationHelper - HV000234: Using org.hibernate.validator.internal.engine.DefaultClockProvider as ValidatorFactory-scoped clock provider.
  255. 16:02:57.507 [main] DEBUG org.hibernate.validator.internal.engine.ValidatorFactoryConfigurationHelper - HV000234: Using org.hibernate.validator.internal.engine.scripting.DefaultScriptEvaluatorFactory as ValidatorFactory-scoped script evaluator factory.
  256. 16:02:57.508 [main] DEBUG _org.springframework.web.servlet.HandlerMapping.Mappings -
  257. c.z.w.c.c.CockpitFacilityGeometryController:
  258. {GET [/api/cockpit/v1/infrastructure/geometry]}: geometry()
  259. 16:02:57.509 [main] DEBUG org.springframework.web.servlet.mvc.method.annotation.RequestMappingHandlerMapping - 1 mappings in org.springframework.web.servlet.mvc.method.annotation.RequestMappingHandlerMapping
  260. 16:02:57.513 [main] DEBUG org.springframework.web.servlet.mvc.method.annotation.RequestMappingHandlerAdapter - ControllerAdvice beans: 0 @ModelAttribute, 0 @InitBinder, 1 RequestBodyAdvice, 1 ResponseBodyAdvice
  261. 16:02:57.514 [main] DEBUG org.springframework.web.servlet.mvc.method.annotation.ExceptionHandlerExceptionResolver - ControllerAdvice beans: 0 @ExceptionHandler, 1 ResponseBodyAdvice
  262. 16:02:57.514 [main] INFO org.springframework.mock.web.MockServletContext - Initializing Spring TestDispatcherServlet ''
  263. 16:02:57.514 [main] INFO org.springframework.test.web.servlet.TestDispatcherServlet - Initializing Servlet ''
  264. 16:02:57.514 [main] DEBUG org.springframework.test.web.servlet.TestDispatcherServlet - Detected AcceptHeaderLocaleResolver
  265. 16:02:57.514 [main] DEBUG org.springframework.test.web.servlet.TestDispatcherServlet - Detected FixedThemeResolver
  266. 16:02:57.515 [main] DEBUG org.springframework.test.web.servlet.TestDispatcherServlet - Detected org.springframework.web.servlet.view.DefaultRequestToViewNameTranslator@6ddd1c51
  267. 16:02:57.515 [main] DEBUG org.springframework.test.web.servlet.TestDispatcherServlet - Detected org.springframework.web.servlet.support.SessionFlashMapManager@752b69e3
  268. 16:02:57.515 [main] DEBUG org.springframework.test.web.servlet.TestDispatcherServlet - enableLoggingRequestDetails='false': request parameters and headers will be masked to prevent unsafe logging of potentially sensitive data
  269. 16:02:57.515 [main] INFO org.springframework.test.web.servlet.TestDispatcherServlet - Completed initialization in 1 ms
  270. 16:02:57.516 [main] DEBUG org.springframework.test.web.servlet.TestDispatcherServlet - GET "/api/cockpit/v1/infrastructure/geometry", parameters={}
  271. 16:02:57.516 [main] DEBUG org.springframework.web.servlet.mvc.method.annotation.RequestMappingHandlerMapping - Mapped to com.zksy.web.controller.cockpit.CockpitFacilityGeometryController#geometry()
  272. 16:02:57.517 [main] DEBUG org.springframework.web.servlet.mvc.method.annotation.HttpEntityMethodProcessor - Using 'application/json', given [*/*] and supported [application/json, application/*+json]
  273. 16:02:57.518 [main] DEBUG org.springframework.web.servlet.mvc.method.annotation.HttpEntityMethodProcessor - Writing [{msg=操作成功, code=200, data=com.zksy.cockpit.geometry.CockpitFacilityGeometryResponse@2a0b901c}]
  274. 16:02:57.526 [main] DEBUG org.springframework.test.web.servlet.TestDispatcherServlet - Completed 200 OK
  275. 16:02:57.527 [main] DEBUG com.jayway.jsonpath.internal.path.CompiledPath - Evaluating path: $['data']['features'][0]['type']
  276. 16:02:57.527 [main] DEBUG com.jayway.jsonpath.internal.path.CompiledPath - Evaluating path: $['data']['features'][0]['geometry']
  277. 16:02:57.527 [main] DEBUG com.jayway.jsonpath.internal.path.CompiledPath - Evaluating path: $['data']['features'][0]['properties']['networkId']
  278. 16:02:57.527 [main] DEBUG com.jayway.jsonpath.internal.path.CompiledPath - Evaluating path: $['data']['features'][0]['properties']['pointType']
  279. 16:02:57.528 [main] DEBUG com.jayway.jsonpath.internal.path.CompiledPath - Evaluating path: $['data']['features'][0]['properties']['sourceCoordinates'][0][0]
  280. 16:02:57.528 [main] DEBUG com.jayway.jsonpath.internal.path.CompiledPath - Evaluating path: $['data']['features'][0]['properties']['coordinateValidation']['state']
  281. 16:02:57.528 [main] DEBUG com.jayway.jsonpath.internal.path.CompiledPath - Evaluating path: $['data']['features'][0]['properties']['coordinateValidation']['reason']
  282. 16:02:57.528 [main] DEBUG com.jayway.jsonpath.internal.path.CompiledPath - Evaluating path: $['data']['features'][0]['properties']['coordinateValidation']['renderable']
  283. 16:02:57.528 [main] DEBUG com.jayway.jsonpath.internal.path.CompiledPath - Evaluating path: $['data']['features'][0]['properties']['coordinateValidation']['crs']
  284. 16:02:57.530 [main] DEBUG org.hibernate.validator.messageinterpolation.ResourceBundleMessageInterpolator - Loaded expression factory via original TCCL
  285. 16:02:57.530 [main] DEBUG org.hibernate.validator.internal.engine.AbstractConfigurationImpl - Setting custom MessageInterpolator of type org.springframework.validation.beanvalidation.LocaleContextMessageInterpolator
  286. 16:02:57.530 [main] DEBUG org.hibernate.validator.internal.engine.AbstractConfigurationImpl - Setting custom ParameterNameProvider of type org.springframework.validation.beanvalidation.LocalValidatorFactoryBean$1
  287. 16:02:57.530 [main] DEBUG org.hibernate.validator.internal.xml.config.ValidationXmlParser - Trying to load META-INF/validation.xml for XML based Validator configuration.
  288. 16:02:57.530 [main] DEBUG org.hibernate.validator.internal.xml.config.ResourceLoaderHelper - Trying to load META-INF/validation.xml via TCCL
  289. 16:02:57.531 [main] DEBUG org.hibernate.validator.internal.xml.config.ResourceLoaderHelper - Trying to load META-INF/validation.xml via Hibernate Validator's class loader
  290. 16:02:57.531 [main] DEBUG org.hibernate.validator.internal.xml.config.ValidationXmlParser - No META-INF/validation.xml found. Using annotation based configuration only.
  291. 16:02:57.531 [main] DEBUG org.hibernate.validator.internal.engine.resolver.TraversableResolvers - Cannot find javax.persistence.Persistence on classpath. Assuming non JPA 2 environment. All properties will per default be traversable.
  292. 16:02:57.532 [main] DEBUG org.hibernate.validator.internal.engine.ValidatorFactoryConfigurationHelper - HV000252: Using org.hibernate.validator.internal.engine.DefaultPropertyNodeNameProvider as property node name provider.
  293. 16:02:57.532 [main] DEBUG org.hibernate.validator.internal.engine.ValidatorFactoryConfigurationHelper - HV000234: Using org.springframework.validation.beanvalidation.LocaleContextMessageInterpolator as ValidatorFactory-scoped message interpolator.
  294. 16:02:57.532 [main] DEBUG org.hibernate.validator.internal.engine.ValidatorFactoryConfigurationHelper - HV000234: Using org.hibernate.validator.internal.engine.resolver.TraverseAllTraversableResolver as ValidatorFactory-scoped traversable resolver.
  295. 16:02:57.533 [main] DEBUG org.hibernate.validator.internal.engine.ValidatorFactoryConfigurationHelper - HV000234: Using org.hibernate.validator.internal.util.ExecutableParameterNameProvider as ValidatorFactory-scoped parameter name provider.
  296. 16:02:57.533 [main] DEBUG org.hibernate.validator.internal.engine.ValidatorFactoryConfigurationHelper - HV000234: Using org.hibernate.validator.internal.engine.DefaultClockProvider as ValidatorFactory-scoped clock provider.
  297. 16:02:57.533 [main] DEBUG org.hibernate.validator.internal.engine.ValidatorFactoryConfigurationHelper - HV000234: Using org.hibernate.validator.internal.engine.scripting.DefaultScriptEvaluatorFactory as ValidatorFactory-scoped script evaluator factory.
  298. 16:02:57.534 [main] DEBUG _org.springframework.web.servlet.HandlerMapping.Mappings -
  299. c.z.w.c.c.CockpitFacilityGeometryController:
  300. {GET [/api/cockpit/v1/infrastructure/geometry]}: geometry()
  301. 16:02:57.534 [main] DEBUG org.springframework.web.servlet.mvc.method.annotation.RequestMappingHandlerMapping - 1 mappings in org.springframework.web.servlet.mvc.method.annotation.RequestMappingHandlerMapping
  302. 16:02:57.538 [main] DEBUG org.springframework.web.servlet.mvc.method.annotation.RequestMappingHandlerAdapter - ControllerAdvice beans: 0 @ModelAttribute, 0 @InitBinder, 1 RequestBodyAdvice, 1 ResponseBodyAdvice
  303. 16:02:57.539 [main] DEBUG org.springframework.web.servlet.mvc.method.annotation.ExceptionHandlerExceptionResolver - ControllerAdvice beans: 0 @ExceptionHandler, 1 ResponseBodyAdvice
  304. 16:02:57.539 [main] INFO org.springframework.mock.web.MockServletContext - Initializing Spring TestDispatcherServlet ''
  305. 16:02:57.539 [main] INFO org.springframework.test.web.servlet.TestDispatcherServlet - Initializing Servlet ''
  306. 16:02:57.539 [main] DEBUG org.springframework.test.web.servlet.TestDispatcherServlet - Detected AcceptHeaderLocaleResolver
  307. 16:02:57.539 [main] DEBUG org.springframework.test.web.servlet.TestDispatcherServlet - Detected FixedThemeResolver
  308. 16:02:57.539 [main] DEBUG org.springframework.test.web.servlet.TestDispatcherServlet - Detected org.springframework.web.servlet.view.DefaultRequestToViewNameTranslator@2dbfa972
  309. 16:02:57.540 [main] DEBUG org.springframework.test.web.servlet.TestDispatcherServlet - Detected org.springframework.web.servlet.support.SessionFlashMapManager@46f73ffa
  310. 16:02:57.540 [main] DEBUG org.springframework.test.web.servlet.TestDispatcherServlet - enableLoggingRequestDetails='false': request parameters and headers will be masked to prevent unsafe logging of potentially sensitive data
  311. 16:02:57.540 [main] INFO org.springframework.test.web.servlet.TestDispatcherServlet - Completed initialization in 1 ms
  312. 16:02:57.540 [main] DEBUG org.springframework.test.web.servlet.TestDispatcherServlet - POST "/api/cockpit/v1/infrastructure/geometry", parameters={}
  313. 16:02:57.541 [main] WARN org.springframework.web.servlet.mvc.support.DefaultHandlerExceptionResolver - Resolved [org.springframework.web.HttpRequestMethodNotSupportedException: Request method 'POST' not supported]
  314. 16:02:57.541 [main] DEBUG org.springframework.test.web.servlet.TestDispatcherServlet - Completed 405 METHOD_NOT_ALLOWED
  315. 16:02:57.544 [main] DEBUG org.hibernate.validator.messageinterpolation.ResourceBundleMessageInterpolator - Loaded expression factory via original TCCL
  316. 16:02:57.544 [main] DEBUG org.hibernate.validator.internal.engine.AbstractConfigurationImpl - Setting custom MessageInterpolator of type org.springframework.validation.beanvalidation.LocaleContextMessageInterpolator
  317. 16:02:57.544 [main] DEBUG org.hibernate.validator.internal.engine.AbstractConfigurationImpl - Setting custom ParameterNameProvider of type org.springframework.validation.beanvalidation.LocalValidatorFactoryBean$1
  318. 16:02:57.544 [main] DEBUG org.hibernate.validator.internal.xml.config.ValidationXmlParser - Trying to load META-INF/validation.xml for XML based Validator configuration.
  319. 16:02:57.544 [main] DEBUG org.hibernate.validator.internal.xml.config.ResourceLoaderHelper - Trying to load META-INF/validation.xml via TCCL
  320. 16:02:57.545 [main] DEBUG org.hibernate.validator.internal.xml.config.ResourceLoaderHelper - Trying to load META-INF/validation.xml via Hibernate Validator's class loader
  321. 16:02:57.545 [main] DEBUG org.hibernate.validator.internal.xml.config.ValidationXmlParser - No META-INF/validation.xml found. Using annotation based configuration only.
  322. 16:02:57.545 [main] DEBUG org.hibernate.validator.internal.engine.resolver.TraversableResolvers - Cannot find javax.persistence.Persistence on classpath. Assuming non JPA 2 environment. All properties will per default be traversable.
  323. 16:02:57.546 [main] DEBUG org.hibernate.validator.internal.engine.ValidatorFactoryConfigurationHelper - HV000252: Using org.hibernate.validator.internal.engine.DefaultPropertyNodeNameProvider as property node name provider.
  324. 16:02:57.547 [main] DEBUG org.hibernate.validator.internal.engine.ValidatorFactoryConfigurationHelper - HV000234: Using org.springframework.validation.beanvalidation.LocaleContextMessageInterpolator as ValidatorFactory-scoped message interpolator.
  325. 16:02:57.547 [main] DEBUG org.hibernate.validator.internal.engine.ValidatorFactoryConfigurationHelper - HV000234: Using org.hibernate.validator.internal.engine.resolver.TraverseAllTraversableResolver as ValidatorFactory-scoped traversable resolver.
  326. 16:02:57.547 [main] DEBUG org.hibernate.validator.internal.engine.ValidatorFactoryConfigurationHelper - HV000234: Using org.hibernate.validator.internal.util.ExecutableParameterNameProvider as ValidatorFactory-scoped parameter name provider.
  327. 16:02:57.547 [main] DEBUG org.hibernate.validator.internal.engine.ValidatorFactoryConfigurationHelper - HV000234: Using org.hibernate.validator.internal.engine.DefaultClockProvider as ValidatorFactory-scoped clock provider.
  328. 16:02:57.547 [main] DEBUG org.hibernate.validator.internal.engine.ValidatorFactoryConfigurationHelper - HV000234: Using org.hibernate.validator.internal.engine.scripting.DefaultScriptEvaluatorFactory as ValidatorFactory-scoped script evaluator factory.
  329. 16:02:57.548 [main] DEBUG _org.springframework.web.servlet.HandlerMapping.Mappings -
  330. c.z.w.c.c.CockpitFacilityGeometryController:
  331. {GET [/api/cockpit/v1/infrastructure/geometry]}: geometry()
  332. 16:02:57.548 [main] DEBUG org.springframework.web.servlet.mvc.method.annotation.RequestMappingHandlerMapping - 1 mappings in org.springframework.web.servlet.mvc.method.annotation.RequestMappingHandlerMapping
  333. 16:02:57.550 [main] DEBUG org.springframework.web.servlet.mvc.method.annotation.RequestMappingHandlerAdapter - ControllerAdvice beans: 0 @ModelAttribute, 0 @InitBinder, 1 RequestBodyAdvice, 1 ResponseBodyAdvice
  334. 16:02:57.552 [main] DEBUG org.springframework.web.servlet.mvc.method.annotation.ExceptionHandlerExceptionResolver - ControllerAdvice beans: 0 @ExceptionHandler, 1 ResponseBodyAdvice
  335. 16:02:57.552 [main] INFO org.springframework.mock.web.MockServletContext - Initializing Spring TestDispatcherServlet ''
  336. 16:02:57.552 [main] INFO org.springframework.test.web.servlet.TestDispatcherServlet - Initializing Servlet ''
  337. 16:02:57.552 [main] DEBUG org.springframework.test.web.servlet.TestDispatcherServlet - Detected AcceptHeaderLocaleResolver
  338. 16:02:57.552 [main] DEBUG org.springframework.test.web.servlet.TestDispatcherServlet - Detected FixedThemeResolver
  339. 16:02:57.552 [main] DEBUG org.springframework.test.web.servlet.TestDispatcherServlet - Detected org.springframework.web.servlet.view.DefaultRequestToViewNameTranslator@350323a0
  340. 16:02:57.552 [main] DEBUG org.springframework.test.web.servlet.TestDispatcherServlet - Detected org.springframework.web.servlet.support.SessionFlashMapManager@2506b881
  341. 16:02:57.552 [main] DEBUG org.springframework.test.web.servlet.TestDispatcherServlet - enableLoggingRequestDetails='false': request parameters and headers will be masked to prevent unsafe logging of potentially sensitive data
  342. 16:02:57.552 [main] INFO org.springframework.test.web.servlet.TestDispatcherServlet - Completed initialization in 0 ms
  343. 16:02:57.554 [main] DEBUG org.hibernate.validator.messageinterpolation.ResourceBundleMessageInterpolator - Loaded expression factory via original TCCL
  344. 16:02:57.554 [main] DEBUG org.hibernate.validator.internal.engine.AbstractConfigurationImpl - Setting custom MessageInterpolator of type org.springframework.validation.beanvalidation.LocaleContextMessageInterpolator
  345. 16:02:57.554 [main] DEBUG org.hibernate.validator.internal.engine.AbstractConfigurationImpl - Setting custom ParameterNameProvider of type org.springframework.validation.beanvalidation.LocalValidatorFactoryBean$1
  346. 16:02:57.555 [main] DEBUG org.hibernate.validator.internal.xml.config.ValidationXmlParser - Trying to load META-INF/validation.xml for XML based Validator configuration.
  347. 16:02:57.555 [main] DEBUG org.hibernate.validator.internal.xml.config.ResourceLoaderHelper - Trying to load META-INF/validation.xml via TCCL
  348. 16:02:57.556 [main] DEBUG org.hibernate.validator.internal.xml.config.ResourceLoaderHelper - Trying to load META-INF/validation.xml via Hibernate Validator's class loader
  349. 16:02:57.556 [main] DEBUG org.hibernate.validator.internal.xml.config.ValidationXmlParser - No META-INF/validation.xml found. Using annotation based configuration only.
  350. 16:02:57.557 [main] DEBUG org.hibernate.validator.internal.engine.resolver.TraversableResolvers - Cannot find javax.persistence.Persistence on classpath. Assuming non JPA 2 environment. All properties will per default be traversable.
  351. 16:02:57.557 [main] DEBUG org.hibernate.validator.internal.engine.ValidatorFactoryConfigurationHelper - HV000252: Using org.hibernate.validator.internal.engine.DefaultPropertyNodeNameProvider as property node name provider.
  352. 16:02:57.557 [main] DEBUG org.hibernate.validator.internal.engine.ValidatorFactoryConfigurationHelper - HV000234: Using org.springframework.validation.beanvalidation.LocaleContextMessageInterpolator as ValidatorFactory-scoped message interpolator.
  353. 16:02:57.557 [main] DEBUG org.hibernate.validator.internal.engine.ValidatorFactoryConfigurationHelper - HV000234: Using org.hibernate.validator.internal.engine.resolver.TraverseAllTraversableResolver as ValidatorFactory-scoped traversable resolver.
  354. 16:02:57.557 [main] DEBUG org.hibernate.validator.internal.engine.ValidatorFactoryConfigurationHelper - HV000234: Using org.hibernate.validator.internal.util.ExecutableParameterNameProvider as ValidatorFactory-scoped parameter name provider.
  355. 16:02:57.557 [main] DEBUG org.hibernate.validator.internal.engine.ValidatorFactoryConfigurationHelper - HV000234: Using org.hibernate.validator.internal.engine.DefaultClockProvider as ValidatorFactory-scoped clock provider.
  356. 16:02:57.557 [main] DEBUG org.hibernate.validator.internal.engine.ValidatorFactoryConfigurationHelper - HV000234: Using org.hibernate.validator.internal.engine.scripting.DefaultScriptEvaluatorFactory as ValidatorFactory-scoped script evaluator factory.
  357. 16:02:57.558 [main] DEBUG _org.springframework.web.servlet.HandlerMapping.Mappings -
  358. c.z.w.c.c.CockpitFacilityGeometryController:
  359. {GET [/api/cockpit/v1/infrastructure/geometry]}: geometry()
  360. 16:02:57.559 [main] DEBUG org.springframework.web.servlet.mvc.method.annotation.RequestMappingHandlerMapping - 1 mappings in org.springframework.web.servlet.mvc.method.annotation.RequestMappingHandlerMapping
  361. 16:02:57.562 [main] DEBUG org.springframework.web.servlet.mvc.method.annotation.RequestMappingHandlerAdapter - ControllerAdvice beans: 0 @ModelAttribute, 0 @InitBinder, 1 RequestBodyAdvice, 1 ResponseBodyAdvice
  362. 16:02:57.563 [main] DEBUG org.springframework.web.servlet.mvc.method.annotation.ExceptionHandlerExceptionResolver - ControllerAdvice beans: 0 @ExceptionHandler, 1 ResponseBodyAdvice
  363. 16:02:57.563 [main] INFO org.springframework.mock.web.MockServletContext - Initializing Spring TestDispatcherServlet ''
  364. 16:02:57.563 [main] INFO org.springframework.test.web.servlet.TestDispatcherServlet - Initializing Servlet ''
  365. 16:02:57.563 [main] DEBUG org.springframework.test.web.servlet.TestDispatcherServlet - Detected AcceptHeaderLocaleResolver
  366. 16:02:57.563 [main] DEBUG org.springframework.test.web.servlet.TestDispatcherServlet - Detected FixedThemeResolver
  367. 16:02:57.563 [main] DEBUG org.springframework.test.web.servlet.TestDispatcherServlet - Detected org.springframework.web.servlet.view.DefaultRequestToViewNameTranslator@2eb0cefe
  368. 16:02:57.563 [main] DEBUG org.springframework.test.web.servlet.TestDispatcherServlet - Detected org.springframework.web.servlet.support.SessionFlashMapManager@5a2ae1ab
  369. 16:02:57.563 [main] DEBUG org.springframework.test.web.servlet.TestDispatcherServlet - enableLoggingRequestDetails='false': request parameters and headers will be masked to prevent unsafe logging of potentially sensitive data
  370. 16:02:57.563 [main] INFO org.springframework.test.web.servlet.TestDispatcherServlet - Completed initialization in 0 ms
  371. 16:02:57.563 [main] DEBUG org.springframework.test.web.servlet.TestDispatcherServlet - GET "/api/cockpit/v1/infrastructure/geometry", parameters={}
  372. 16:02:57.563 [main] DEBUG org.springframework.web.servlet.mvc.method.annotation.RequestMappingHandlerMapping - Mapped to com.zksy.web.controller.cockpit.CockpitFacilityGeometryController#geometry()
  373. 16:02:57.568 [main] DEBUG org.springframework.web.servlet.mvc.method.annotation.HttpEntityMethodProcessor - Using 'application/json', given [*/*] and supported [application/json, application/*+json]
  374. 16:02:57.568 [main] DEBUG org.springframework.web.servlet.mvc.method.annotation.HttpEntityMethodProcessor - Writing [{msg=操作成功, code=200, data=com.zksy.cockpit.geometry.CockpitFacilityGeometryResponse@1c5d3a37}]
  375. 16:02:57.575 [main] DEBUG org.springframework.test.web.servlet.TestDispatcherServlet - Completed 200 OK
  376. 16:02:57.576 [main] DEBUG com.jayway.jsonpath.internal.path.CompiledPath - Evaluating path: $['data']['features']
  377. 16:02:57.576 [main] DEBUG com.jayway.jsonpath.internal.path.CompiledPath - Evaluating path: $['data']['features'][0]['geometry']['type']
  378. 16:02:57.576 [main] DEBUG com.jayway.jsonpath.internal.path.CompiledPath - Evaluating path: $['data']['features'][0]['properties']['diameter']
  379. 16:02:57.577 [main] DEBUG com.jayway.jsonpath.internal.path.CompiledPath - Evaluating path: $['data']['features'][1]['properties']['diameter']
  380. 16:02:57.577 [main] DEBUG com.jayway.jsonpath.internal.path.CompiledPath - Evaluating path: $['data']['features'][0]['geometry']['coordinates']
  381. 16:02:57.578 [main] DEBUG com.jayway.jsonpath.internal.path.CompiledPath - Evaluating path: $['data']['features'][0]['geometry']['coordinates'][0][0]
  382. 16:02:57.578 [main] DEBUG com.jayway.jsonpath.internal.path.CompiledPath - Evaluating path: $['data']['features'][0]['geometry']['coordinates'][0][1]
  383. 16:02:57.579 [main] DEBUG com.jayway.jsonpath.internal.path.CompiledPath - Evaluating path: $['data']['features'][0]['geometry']['coordinates'][1][0]
  384. 16:02:57.579 [main] DEBUG com.jayway.jsonpath.internal.path.CompiledPath - Evaluating path: $['data']['features'][0]['geometry']['coordinates'][1][1]
  385. 16:02:57.580 [main] DEBUG com.jayway.jsonpath.internal.path.CompiledPath - Evaluating path: $['data']['features'][1]['geometry']['type']
  386. 16:02:57.580 [main] DEBUG com.jayway.jsonpath.internal.path.CompiledPath - Evaluating path: $['data']['features'][1]['geometry']['coordinates']
  387. 16:02:57.580 [main] DEBUG com.jayway.jsonpath.internal.path.CompiledPath - Evaluating path: $['data']['features'][1]['geometry']['coordinates'][0]
  388. 16:02:57.581 [main] DEBUG com.jayway.jsonpath.internal.path.CompiledPath - Evaluating path: $['data']['features'][1]['geometry']['coordinates'][1]
  389. 16:02:57.581 [main] DEBUG com.jayway.jsonpath.internal.path.CompiledPath - Evaluating path: $['data']['features'][1]['properties']['pointType']
  390. 16:02:57.581 [main] DEBUG com.jayway.jsonpath.internal.path.CompiledPath - Evaluating path: $['data']['features'][1]['properties']['networkId']
  391. 16:02:57.582 [main] DEBUG com.jayway.jsonpath.internal.path.CompiledPath - Evaluating path: $['data']['features'][1]['properties']['coordinateValidation']['state']
  392. 16:02:57.582 [main] DEBUG com.jayway.jsonpath.internal.path.CompiledPath - Evaluating path: $['data']['features'][1]['properties']['coordinateValidation']['renderable']
  393. 16:02:57.583 [main] DEBUG org.hibernate.validator.messageinterpolation.ResourceBundleMessageInterpolator - Loaded expression factory via original TCCL
  394. 16:02:57.583 [main] DEBUG org.hibernate.validator.internal.engine.AbstractConfigurationImpl - Setting custom MessageInterpolator of type org.springframework.validation.beanvalidation.LocaleContextMessageInterpolator
  395. 16:02:57.583 [main] DEBUG org.hibernate.validator.internal.engine.AbstractConfigurationImpl - Setting custom ParameterNameProvider of type org.springframework.validation.beanvalidation.LocalValidatorFactoryBean$1
  396. 16:02:57.584 [main] DEBUG org.hibernate.validator.internal.xml.config.ValidationXmlParser - Trying to load META-INF/validation.xml for XML based Validator configuration.
  397. 16:02:57.584 [main] DEBUG org.hibernate.validator.internal.xml.config.ResourceLoaderHelper - Trying to load META-INF/validation.xml via TCCL
  398. 16:02:57.584 [main] DEBUG org.hibernate.validator.internal.xml.config.ResourceLoaderHelper - Trying to load META-INF/validation.xml via Hibernate Validator's class loader
  399. 16:02:57.584 [main] DEBUG org.hibernate.validator.internal.xml.config.ValidationXmlParser - No META-INF/validation.xml found. Using annotation based configuration only.
  400. 16:02:57.585 [main] DEBUG org.hibernate.validator.internal.engine.resolver.TraversableResolvers - Cannot find javax.persistence.Persistence on classpath. Assuming non JPA 2 environment. All properties will per default be traversable.
  401. 16:02:57.586 [main] DEBUG org.hibernate.validator.internal.engine.ValidatorFactoryConfigurationHelper - HV000252: Using org.hibernate.validator.internal.engine.DefaultPropertyNodeNameProvider as property node name provider.
  402. 16:02:57.586 [main] DEBUG org.hibernate.validator.internal.engine.ValidatorFactoryConfigurationHelper - HV000234: Using org.springframework.validation.beanvalidation.LocaleContextMessageInterpolator as ValidatorFactory-scoped message interpolator.
  403. 16:02:57.586 [main] DEBUG org.hibernate.validator.internal.engine.ValidatorFactoryConfigurationHelper - HV000234: Using org.hibernate.validator.internal.engine.resolver.TraverseAllTraversableResolver as ValidatorFactory-scoped traversable resolver.
  404. 16:02:57.586 [main] DEBUG org.hibernate.validator.internal.engine.ValidatorFactoryConfigurationHelper - HV000234: Using org.hibernate.validator.internal.util.ExecutableParameterNameProvider as ValidatorFactory-scoped parameter name provider.
  405. 16:02:57.586 [main] DEBUG org.hibernate.validator.internal.engine.ValidatorFactoryConfigurationHelper - HV000234: Using org.hibernate.validator.internal.engine.DefaultClockProvider as ValidatorFactory-scoped clock provider.
  406. 16:02:57.586 [main] DEBUG org.hibernate.validator.internal.engine.ValidatorFactoryConfigurationHelper - HV000234: Using org.hibernate.validator.internal.engine.scripting.DefaultScriptEvaluatorFactory as ValidatorFactory-scoped script evaluator factory.
  407. 16:02:57.588 [main] DEBUG _org.springframework.web.servlet.HandlerMapping.Mappings -
  408. c.z.w.c.c.CockpitFacilityGeometryController:
  409. {GET [/api/cockpit/v1/infrastructure/geometry]}: geometry()
  410. 16:02:57.588 [main] DEBUG org.springframework.web.servlet.mvc.method.annotation.RequestMappingHandlerMapping - 1 mappings in org.springframework.web.servlet.mvc.method.annotation.RequestMappingHandlerMapping
  411. 16:02:57.592 [main] DEBUG org.springframework.web.servlet.mvc.method.annotation.RequestMappingHandlerAdapter - ControllerAdvice beans: 0 @ModelAttribute, 0 @InitBinder, 1 RequestBodyAdvice, 1 ResponseBodyAdvice
  412. 16:02:57.593 [main] DEBUG org.springframework.web.servlet.mvc.method.annotation.ExceptionHandlerExceptionResolver - ControllerAdvice beans: 0 @ExceptionHandler, 1 ResponseBodyAdvice
  413. 16:02:57.594 [main] INFO org.springframework.mock.web.MockServletContext - Initializing Spring TestDispatcherServlet ''
  414. 16:02:57.594 [main] INFO org.springframework.test.web.servlet.TestDispatcherServlet - Initializing Servlet ''
  415. 16:02:57.594 [main] DEBUG org.springframework.test.web.servlet.TestDispatcherServlet - Detected AcceptHeaderLocaleResolver
  416. 16:02:57.594 [main] DEBUG org.springframework.test.web.servlet.TestDispatcherServlet - Detected FixedThemeResolver
  417. 16:02:57.594 [main] DEBUG org.springframework.test.web.servlet.TestDispatcherServlet - Detected org.springframework.web.servlet.view.DefaultRequestToViewNameTranslator@62f9c790
  418. 16:02:57.594 [main] DEBUG org.springframework.test.web.servlet.TestDispatcherServlet - Detected org.springframework.web.servlet.support.SessionFlashMapManager@21e5f0b6
  419. 16:02:57.594 [main] DEBUG org.springframework.test.web.servlet.TestDispatcherServlet - enableLoggingRequestDetails='false': request parameters and headers will be masked to prevent unsafe logging of potentially sensitive data
  420. 16:02:57.594 [main] INFO org.springframework.test.web.servlet.TestDispatcherServlet - Completed initialization in 0 ms
  421. 16:02:57.596 [main] DEBUG org.springframework.test.web.servlet.TestDispatcherServlet - GET "/api/cockpit/v1/infrastructure/geometry", parameters={}
  422. 16:02:57.596 [main] DEBUG org.springframework.web.servlet.mvc.method.annotation.RequestMappingHandlerMapping - Mapped to com.zksy.web.controller.cockpit.CockpitFacilityGeometryController#geometry()
  423. 16:02:57.597 [main] DEBUG org.springframework.web.servlet.mvc.method.annotation.ExceptionHandlerExceptionResolver - Using @ExceptionHandler com.zksy.web.controller.cockpit.CockpitFacilityGeometryController#handleReadFailure(HttpServletRequest, RuntimeException)
  424. 16:02:57.599 [main] ERROR com.zksy.web.controller.cockpit.CockpitFacilityGeometryController - Facility geometry read failed
  425. org.springframework.transaction.CannotCreateTransactionException: private connection detail
  426. at com.zksy.web.controller.cockpit.CockpitFacilityGeometryController.geometry(CockpitFacilityGeometryController.java:31)
  427. at java.base/jdk.internal.reflect.NativeMethodAccessorImpl.invoke0(Native Method)
  428. at java.base/jdk.internal.reflect.NativeMethodAccessorImpl.invoke(NativeMethodAccessorImpl.java:77)
  429. at java.base/jdk.internal.reflect.DelegatingMethodAccessorImpl.invoke(DelegatingMethodAccessorImpl.java:43)
  430. at java.base/java.lang.reflect.Method.invoke(Method.java:568)
  431. at org.springframework.web.method.support.InvocableHandlerMethod.doInvoke(InvocableHandlerMethod.java:205)
  432. at org.springframework.web.method.support.InvocableHandlerMethod.invokeForRequest(InvocableHandlerMethod.java:150)
  433. at org.springframework.web.servlet.mvc.method.annotation.ServletInvocableHandlerMethod.invokeAndHandle(ServletInvocableHandlerMethod.java:117)
  434. at org.springframework.web.servlet.mvc.method.annotation.RequestMappingHandlerAdapter.invokeHandlerMethod(RequestMappingHandlerAdapter.java:903)
  435. at org.springframework.web.servlet.mvc.method.annotation.RequestMappingHandlerAdapter.handleInternal(RequestMappingHandlerAdapter.java:809)
  436. at org.springframework.web.servlet.mvc.method.AbstractHandlerMethodAdapter.handle(AbstractHandlerMethodAdapter.java:87)
  437. at org.springframework.web.servlet.DispatcherServlet.doDispatch(DispatcherServlet.java:1072)
  438. at org.springframework.web.servlet.DispatcherServlet.doService(DispatcherServlet.java:965)
  439. at org.springframework.web.servlet.FrameworkServlet.processRequest(FrameworkServlet.java:1006)
  440. at org.springframework.web.servlet.FrameworkServlet.doGet(FrameworkServlet.java:898)
  441. at javax.servlet.http.HttpServlet.service(HttpServlet.java:529)
  442. at org.springframework.web.servlet.FrameworkServlet.service(FrameworkServlet.java:883)
  443. at org.springframework.test.web.servlet.TestDispatcherServlet.service(TestDispatcherServlet.java:72)
  444. at javax.servlet.http.HttpServlet.service(HttpServlet.java:623)
  445. at org.springframework.mock.web.MockFilterChain$ServletFilterProxy.doFilter(MockFilterChain.java:167)
  446. at org.springframework.mock.web.MockFilterChain.doFilter(MockFilterChain.java:134)
  447. at org.springframework.test.web.servlet.MockMvc.perform(MockMvc.java:201)
  448. at com.zksy.web.controller.cockpit.CockpitFacilityGeometryControllerTest.transactionProxyFailureIsAlsoMappedToSanitized500(CockpitFacilityGeometryControllerTest.java:148)
  449. at java.base/jdk.internal.reflect.NativeMethodAccessorImpl.invoke0(Native Method)
  450. at java.base/jdk.internal.reflect.NativeMethodAccessorImpl.invoke(NativeMethodAccessorImpl.java:77)
  451. at java.base/jdk.internal.reflect.DelegatingMethodAccessorImpl.invoke(DelegatingMethodAccessorImpl.java:43)
  452. at java.base/java.lang.reflect.Method.invoke(Method.java:568)
  453. at org.junit.platform.commons.util.ReflectionUtils.invokeMethod(ReflectionUtils.java:688)
  454. at org.junit.jupiter.engine.execution.MethodInvocation.proceed(MethodInvocation.java:60)
  455. at org.junit.jupiter.engine.execution.InvocationInterceptorChain$ValidatingInvocation.proceed(InvocationInterceptorChain.java:131)
  456. at org.junit.jupiter.engine.extension.TimeoutExtension.intercept(TimeoutExtension.java:149)
  457. at org.junit.jupiter.engine.extension.TimeoutExtension.interceptTestableMethod(TimeoutExtension.java:140)
  458. at org.junit.jupiter.engine.extension.TimeoutExtension.interceptTestMethod(TimeoutExtension.java:84)
  459. at org.junit.jupiter.engine.execution.ExecutableInvoker$ReflectiveInterceptorCall.lambda$ofVoidMethod$0(ExecutableInvoker.java:115)
  460. at org.junit.jupiter.engine.execution.ExecutableInvoker.lambda$invoke$0(ExecutableInvoker.java:105)
  461. at org.junit.jupiter.engine.execution.InvocationInterceptorChain$InterceptedInvocation.proceed(InvocationInterceptorChain.java:106)
  462. at org.junit.jupiter.engine.execution.InvocationInterceptorChain.proceed(InvocationInterceptorChain.java:64)
  463. at org.junit.jupiter.engine.execution.InvocationInterceptorChain.chainAndInvoke(InvocationInterceptorChain.java:45)
  464. at org.junit.jupiter.engine.execution.InvocationInterceptorChain.invoke(InvocationInterceptorChain.java:37)
  465. at org.junit.jupiter.engine.execution.ExecutableInvoker.invoke(ExecutableInvoker.java:104)
  466. at org.junit.jupiter.engine.execution.ExecutableInvoker.invoke(ExecutableInvoker.java:98)
  467. at org.junit.jupiter.engine.descriptor.TestMethodTestDescriptor.lambda$invokeTestMethod$6(TestMethodTestDescriptor.java:210)
  468. at org.junit.platform.engine.support.hierarchical.ThrowableCollector.execute(ThrowableCollector.java:73)
  469. at org.junit.jupiter.engine.descriptor.TestMethodTestDescriptor.invokeTestMethod(TestMethodTestDescriptor.java:206)
  470. at org.junit.jupiter.engine.descriptor.TestMethodTestDescriptor.execute(TestMethodTestDescriptor.java:131)
  471. at org.junit.jupiter.engine.descriptor.TestMethodTestDescriptor.execute(TestMethodTestDescriptor.java:65)
  472. at org.junit.platform.engine.support.hierarchical.NodeTestTask.lambda$executeRecursively$5(NodeTestTask.java:139)
  473. at org.junit.platform.engine.support.hierarchical.ThrowableCollector.execute(ThrowableCollector.java:73)
  474. at org.junit.platform.engine.support.hierarchical.NodeTestTask.lambda$executeRecursively$7(NodeTestTask.java:129)
  475. at org.junit.platform.engine.support.hierarchical.Node.around(Node.java:137)
  476. at org.junit.platform.engine.support.hierarchical.NodeTestTask.lambda$executeRecursively$8(NodeTestTask.java:127)
  477. at org.junit.platform.engine.support.hierarchical.ThrowableCollector.execute(ThrowableCollector.java:73)
  478. at org.junit.platform.engine.support.hierarchical.NodeTestTask.executeRecursively(NodeTestTask.java:126)
  479. at org.junit.platform.engine.support.hierarchical.NodeTestTask.execute(NodeTestTask.java:84)
  480. at java.base/java.util.ArrayList.forEach(ArrayList.java:1511)
  481. at org.junit.platform.engine.support.hierarchical.SameThreadHierarchicalTestExecutorService.invokeAll(SameThreadHierarchicalTestExecutorService.java:38)
  482. at org.junit.platform.engine.support.hierarchical.NodeTestTask.lambda$executeRecursively$5(NodeTestTask.java:143)
  483. at org.junit.platform.engine.support.hierarchical.ThrowableCollector.execute(ThrowableCollector.java:73)
  484. at org.junit.platform.engine.support.hierarchical.NodeTestTask.lambda$executeRecursively$7(NodeTestTask.java:129)
  485. at org.junit.platform.engine.support.hierarchical.Node.around(Node.java:137)
  486. at org.junit.platform.engine.support.hierarchical.NodeTestTask.lambda$executeRecursively$8(NodeTestTask.java:127)
  487. at org.junit.platform.engine.support.hierarchical.ThrowableCollector.execute(ThrowableCollector.java:73)
  488. at org.junit.platform.engine.support.hierarchical.NodeTestTask.executeRecursively(NodeTestTask.java:126)
  489. at org.junit.platform.engine.support.hierarchical.NodeTestTask.execute(NodeTestTask.java:84)
  490. at java.base/java.util.ArrayList.forEach(ArrayList.java:1511)
  491. at org.junit.platform.engine.support.hierarchical.SameThreadHierarchicalTestExecutorService.invokeAll(SameThreadHierarchicalTestExecutorService.java:38)
  492. at org.junit.platform.engine.support.hierarchical.NodeTestTask.lambda$executeRecursively$5(NodeTestTask.java:143)
  493. at org.junit.platform.engine.support.hierarchical.ThrowableCollector.execute(ThrowableCollector.java:73)
  494. at org.junit.platform.engine.support.hierarchical.NodeTestTask.lambda$executeRecursively$7(NodeTestTask.java:129)
  495. at org.junit.platform.engine.support.hierarchical.Node.around(Node.java:137)
  496. at org.junit.platform.engine.support.hierarchical.NodeTestTask.lambda$executeRecursively$8(NodeTestTask.java:127)
  497. at org.junit.platform.engine.support.hierarchical.ThrowableCollector.execute(ThrowableCollector.java:73)
  498. at org.junit.platform.engine.support.hierarchical.NodeTestTask.executeRecursively(NodeTestTask.java:126)
  499. at org.junit.platform.engine.support.hierarchical.NodeTestTask.execute(NodeTestTask.java:84)
  500. at org.junit.platform.engine.support.hierarchical.SameThreadHierarchicalTestExecutorService.submit(SameThreadHierarchicalTestExecutorService.java:32)
  501. at org.junit.platform.engine.support.hierarchical.HierarchicalTestExecutor.execute(HierarchicalTestExecutor.java:57)
  502. at org.junit.platform.engine.support.hierarchical.HierarchicalTestEngine.execute(HierarchicalTestEngine.java:51)
  503. at org.junit.platform.launcher.core.DefaultLauncher.execute(DefaultLauncher.java:220)
  504. at org.junit.platform.launcher.core.DefaultLauncher.lambda$execute$6(DefaultLauncher.java:188)
  505. at org.junit.platform.launcher.core.DefaultLauncher.withInterceptedStreams(DefaultLauncher.java:202)
  506. at org.junit.platform.launcher.core.DefaultLauncher.execute(DefaultLauncher.java:181)
  507. at org.junit.platform.launcher.core.DefaultLauncher.execute(DefaultLauncher.java:128)
  508. at org.apache.maven.surefire.junitplatform.JUnitPlatformProvider.invokeAllTests(JUnitPlatformProvider.java:150)
  509. at org.apache.maven.surefire.junitplatform.JUnitPlatformProvider.invoke(JUnitPlatformProvider.java:124)
  510. at org.apache.maven.surefire.booter.ForkedBooter.invokeProviderInSameClassLoader(ForkedBooter.java:384)
  511. at org.apache.maven.surefire.booter.ForkedBooter.runSuitesInProcess(ForkedBooter.java:345)
  512. at org.apache.maven.surefire.booter.ForkedBooter.execute(ForkedBooter.java:126)
  513. at org.apache.maven.surefire.booter.ForkedBooter.main(ForkedBooter.java:418)
  514. 16:02:57.605 [main] DEBUG org.springframework.web.servlet.mvc.method.annotation.HttpEntityMethodProcessor - Using 'application/json', given [*/*] and supported [application/json, application/*+json]
  515. 16:02:57.605 [main] DEBUG org.springframework.web.servlet.mvc.method.annotation.HttpEntityMethodProcessor - Writing [{msg=facility geometry source unavailable, code=500, data=com.zksy.cockpit.foundation.CockpitErrorPa (truncated)...]
  516. 16:02:57.607 [main] DEBUG org.springframework.web.servlet.mvc.method.annotation.ExceptionHandlerExceptionResolver - Resolved [org.springframework.transaction.CannotCreateTransactionException: private connection detail]
  517. 16:02:57.607 [main] DEBUG org.springframework.test.web.servlet.TestDispatcherServlet - Completed 500 INTERNAL_SERVER_ERROR
  518. 16:02:57.607 [main] DEBUG com.jayway.jsonpath.internal.path.CompiledPath - Evaluating path: $['code']
  519. 16:02:57.607 [main] DEBUG com.jayway.jsonpath.internal.path.CompiledPath - Evaluating path: $['data']['category']
  520. 16:02:57.607 [main] DEBUG com.jayway.jsonpath.internal.path.CompiledPath - Evaluating path: $['data']['message']
  521. 16:02:57.607 [main] DEBUG com.jayway.jsonpath.internal.path.CompiledPath - Evaluating path: $['data']['requestId']
  522. 16:02:57.609 [main] DEBUG org.hibernate.validator.messageinterpolation.ResourceBundleMessageInterpolator - Loaded expression factory via original TCCL
  523. 16:02:57.609 [main] DEBUG org.hibernate.validator.internal.engine.AbstractConfigurationImpl - Setting custom MessageInterpolator of type org.springframework.validation.beanvalidation.LocaleContextMessageInterpolator
  524. 16:02:57.609 [main] DEBUG org.hibernate.validator.internal.engine.AbstractConfigurationImpl - Setting custom ParameterNameProvider of type org.springframework.validation.beanvalidation.LocalValidatorFactoryBean$1
  525. 16:02:57.609 [main] DEBUG org.hibernate.validator.internal.xml.config.ValidationXmlParser - Trying to load META-INF/validation.xml for XML based Validator configuration.
  526. 16:02:57.609 [main] DEBUG org.hibernate.validator.internal.xml.config.ResourceLoaderHelper - Trying to load META-INF/validation.xml via TCCL
  527. 16:02:57.610 [main] DEBUG org.hibernate.validator.internal.xml.config.ResourceLoaderHelper - Trying to load META-INF/validation.xml via Hibernate Validator's class loader
  528. 16:02:57.610 [main] DEBUG org.hibernate.validator.internal.xml.config.ValidationXmlParser - No META-INF/validation.xml found. Using annotation based configuration only.
  529. 16:02:57.610 [main] DEBUG org.hibernate.validator.internal.engine.resolver.TraversableResolvers - Cannot find javax.persistence.Persistence on classpath. Assuming non JPA 2 environment. All properties will per default be traversable.
  530. 16:02:57.611 [main] DEBUG org.hibernate.validator.internal.engine.ValidatorFactoryConfigurationHelper - HV000252: Using org.hibernate.validator.internal.engine.DefaultPropertyNodeNameProvider as property node name provider.
  531. 16:02:57.611 [main] DEBUG org.hibernate.validator.internal.engine.ValidatorFactoryConfigurationHelper - HV000234: Using org.springframework.validation.beanvalidation.LocaleContextMessageInterpolator as ValidatorFactory-scoped message interpolator.
  532. 16:02:57.612 [main] DEBUG org.hibernate.validator.internal.engine.ValidatorFactoryConfigurationHelper - HV000234: Using org.hibernate.validator.internal.engine.resolver.TraverseAllTraversableResolver as ValidatorFactory-scoped traversable resolver.
  533. 16:02:57.612 [main] DEBUG org.hibernate.validator.internal.engine.ValidatorFactoryConfigurationHelper - HV000234: Using org.hibernate.validator.internal.util.ExecutableParameterNameProvider as ValidatorFactory-scoped parameter name provider.
  534. 16:02:57.612 [main] DEBUG org.hibernate.validator.internal.engine.ValidatorFactoryConfigurationHelper - HV000234: Using org.hibernate.validator.internal.engine.DefaultClockProvider as ValidatorFactory-scoped clock provider.
  535. 16:02:57.612 [main] DEBUG org.hibernate.validator.internal.engine.ValidatorFactoryConfigurationHelper - HV000234: Using org.hibernate.validator.internal.engine.scripting.DefaultScriptEvaluatorFactory as ValidatorFactory-scoped script evaluator factory.
  536. 16:02:57.613 [main] DEBUG _org.springframework.web.servlet.HandlerMapping.Mappings -
  537. c.z.w.c.c.CockpitFacilityGeometryController:
  538. {GET [/api/cockpit/v1/infrastructure/geometry]}: geometry()
  539. 16:02:57.613 [main] DEBUG org.springframework.web.servlet.mvc.method.annotation.RequestMappingHandlerMapping - 1 mappings in org.springframework.web.servlet.mvc.method.annotation.RequestMappingHandlerMapping
  540. 16:02:57.616 [main] DEBUG org.springframework.web.servlet.mvc.method.annotation.RequestMappingHandlerAdapter - ControllerAdvice beans: 0 @ModelAttribute, 0 @InitBinder, 1 RequestBodyAdvice, 1 ResponseBodyAdvice
  541. 16:02:57.617 [main] DEBUG org.springframework.web.servlet.mvc.method.annotation.ExceptionHandlerExceptionResolver - ControllerAdvice beans: 0 @ExceptionHandler, 1 ResponseBodyAdvice
  542. 16:02:57.618 [main] INFO org.springframework.mock.web.MockServletContext - Initializing Spring TestDispatcherServlet ''
  543. 16:02:57.618 [main] INFO org.springframework.test.web.servlet.TestDispatcherServlet - Initializing Servlet ''
  544. 16:02:57.618 [main] DEBUG org.springframework.test.web.servlet.TestDispatcherServlet - Detected AcceptHeaderLocaleResolver
  545. 16:02:57.618 [main] DEBUG org.springframework.test.web.servlet.TestDispatcherServlet - Detected FixedThemeResolver
  546. 16:02:57.618 [main] DEBUG org.springframework.test.web.servlet.TestDispatcherServlet - Detected org.springframework.web.servlet.view.DefaultRequestToViewNameTranslator@3f5dfe69
  547. 16:02:57.618 [main] DEBUG org.springframework.test.web.servlet.TestDispatcherServlet - Detected org.springframework.web.servlet.support.SessionFlashMapManager@571a663c
  548. 16:02:57.618 [main] DEBUG org.springframework.test.web.servlet.TestDispatcherServlet - enableLoggingRequestDetails='false': request parameters and headers will be masked to prevent unsafe logging of potentially sensitive data
  549. 16:02:57.618 [main] INFO org.springframework.test.web.servlet.TestDispatcherServlet - Completed initialization in 0 ms
  550. 16:02:57.619 [main] DEBUG org.springframework.test.web.servlet.TestDispatcherServlet - GET "/api/cockpit/v1/infrastructure/geometry", parameters={}
  551. 16:02:57.619 [main] DEBUG org.springframework.web.servlet.mvc.method.annotation.RequestMappingHandlerMapping - Mapped to com.zksy.web.controller.cockpit.CockpitFacilityGeometryController#geometry()
  552. 16:02:57.621 [main] DEBUG org.springframework.web.servlet.mvc.method.annotation.ExceptionHandlerExceptionResolver - Using @ExceptionHandler com.zksy.web.controller.cockpit.CockpitFacilityGeometryController#handleReadFailure(HttpServletRequest, RuntimeException)
  553. 16:02:57.621 [main] ERROR com.zksy.web.controller.cockpit.CockpitFacilityGeometryController - Facility geometry read failed
  554. com.zksy.cockpit.foundation.CockpitReadException: private database details
  555. at com.zksy.web.controller.cockpit.CockpitFacilityGeometryController.geometry(CockpitFacilityGeometryController.java:31)
  556. at java.base/jdk.internal.reflect.NativeMethodAccessorImpl.invoke0(Native Method)
  557. at java.base/jdk.internal.reflect.NativeMethodAccessorImpl.invoke(NativeMethodAccessorImpl.java:77)
  558. at java.base/jdk.internal.reflect.DelegatingMethodAccessorImpl.invoke(DelegatingMethodAccessorImpl.java:43)
  559. at java.base/java.lang.reflect.Method.invoke(Method.java:568)
  560. at org.springframework.web.method.support.InvocableHandlerMethod.doInvoke(InvocableHandlerMethod.java:205)
  561. at org.springframework.web.method.support.InvocableHandlerMethod.invokeForRequest(InvocableHandlerMethod.java:150)
  562. at org.springframework.web.servlet.mvc.method.annotation.ServletInvocableHandlerMethod.invokeAndHandle(ServletInvocableHandlerMethod.java:117)
  563. at org.springframework.web.servlet.mvc.method.annotation.RequestMappingHandlerAdapter.invokeHandlerMethod(RequestMappingHandlerAdapter.java:903)
  564. at org.springframework.web.servlet.mvc.method.annotation.RequestMappingHandlerAdapter.handleInternal(RequestMappingHandlerAdapter.java:809)
  565. at org.springframework.web.servlet.mvc.method.AbstractHandlerMethodAdapter.handle(AbstractHandlerMethodAdapter.java:87)
  566. at org.springframework.web.servlet.DispatcherServlet.doDispatch(DispatcherServlet.java:1072)
  567. at org.springframework.web.servlet.DispatcherServlet.doService(DispatcherServlet.java:965)
  568. at org.springframework.web.servlet.FrameworkServlet.processRequest(FrameworkServlet.java:1006)
  569. at org.springframework.web.servlet.FrameworkServlet.doGet(FrameworkServlet.java:898)
  570. at javax.servlet.http.HttpServlet.service(HttpServlet.java:529)
  571. at org.springframework.web.servlet.FrameworkServlet.service(FrameworkServlet.java:883)
  572. at org.springframework.test.web.servlet.TestDispatcherServlet.service(TestDispatcherServlet.java:72)
  573. at javax.servlet.http.HttpServlet.service(HttpServlet.java:623)
  574. at org.springframework.mock.web.MockFilterChain$ServletFilterProxy.doFilter(MockFilterChain.java:167)
  575. at org.springframework.mock.web.MockFilterChain.doFilter(MockFilterChain.java:134)
  576. at org.springframework.test.web.servlet.MockMvc.perform(MockMvc.java:201)
  577. at com.zksy.web.controller.cockpit.CockpitFacilityGeometryControllerTest.sourceFailureReturns500AndStableCategoryRatherThanSuccess(CockpitFacilityGeometryControllerTest.java:88)
  578. at java.base/jdk.internal.reflect.NativeMethodAccessorImpl.invoke0(Native Method)
  579. at java.base/jdk.internal.reflect.NativeMethodAccessorImpl.invoke(NativeMethodAccessorImpl.java:77)
  580. at java.base/jdk.internal.reflect.DelegatingMethodAccessorImpl.invoke(DelegatingMethodAccessorImpl.java:43)
  581. at java.base/java.lang.reflect.Method.invoke(Method.java:568)
  582. at org.junit.platform.commons.util.ReflectionUtils.invokeMethod(ReflectionUtils.java:688)
  583. at org.junit.jupiter.engine.execution.MethodInvocation.proceed(MethodInvocation.java:60)
  584. at org.junit.jupiter.engine.execution.InvocationInterceptorChain$ValidatingInvocation.proceed(InvocationInterceptorChain.java:131)
  585. at org.junit.jupiter.engine.extension.TimeoutExtension.intercept(TimeoutExtension.java:149)
  586. at org.junit.jupiter.engine.extension.TimeoutExtension.interceptTestableMethod(TimeoutExtension.java:140)
  587. at org.junit.jupiter.engine.extension.TimeoutExtension.interceptTestMethod(TimeoutExtension.java:84)
  588. at org.junit.jupiter.engine.execution.ExecutableInvoker$ReflectiveInterceptorCall.lambda$ofVoidMethod$0(ExecutableInvoker.java:115)
  589. at org.junit.jupiter.engine.execution.ExecutableInvoker.lambda$invoke$0(ExecutableInvoker.java:105)
  590. at org.junit.jupiter.engine.execution.InvocationInterceptorChain$InterceptedInvocation.proceed(InvocationInterceptorChain.java:106)
  591. at org.junit.jupiter.engine.execution.InvocationInterceptorChain.proceed(InvocationInterceptorChain.java:64)
  592. at org.junit.jupiter.engine.execution.InvocationInterceptorChain.chainAndInvoke(InvocationInterceptorChain.java:45)
  593. at org.junit.jupiter.engine.execution.InvocationInterceptorChain.invoke(InvocationInterceptorChain.java:37)
  594. at org.junit.jupiter.engine.execution.ExecutableInvoker.invoke(ExecutableInvoker.java:104)
  595. at org.junit.jupiter.engine.execution.ExecutableInvoker.invoke(ExecutableInvoker.java:98)
  596. at org.junit.jupiter.engine.descriptor.TestMethodTestDescriptor.lambda$invokeTestMethod$6(TestMethodTestDescriptor.java:210)
  597. at org.junit.platform.engine.support.hierarchical.ThrowableCollector.execute(ThrowableCollector.java:73)
  598. at org.junit.jupiter.engine.descriptor.TestMethodTestDescriptor.invokeTestMethod(TestMethodTestDescriptor.java:206)
  599. at org.junit.jupiter.engine.descriptor.TestMethodTestDescriptor.execute(TestMethodTestDescriptor.java:131)
  600. at org.junit.jupiter.engine.descriptor.TestMethodTestDescriptor.execute(TestMethodTestDescriptor.java:65)
  601. at org.junit.platform.engine.support.hierarchical.NodeTestTask.lambda$executeRecursively$5(NodeTestTask.java:139)
  602. at org.junit.platform.engine.support.hierarchical.ThrowableCollector.execute(ThrowableCollector.java:73)
  603. at org.junit.platform.engine.support.hierarchical.NodeTestTask.lambda$executeRecursively$7(NodeTestTask.java:129)
  604. at org.junit.platform.engine.support.hierarchical.Node.around(Node.java:137)
  605. at org.junit.platform.engine.support.hierarchical.NodeTestTask.lambda$executeRecursively$8(NodeTestTask.java:127)
  606. at org.junit.platform.engine.support.hierarchical.ThrowableCollector.execute(ThrowableCollector.java:73)
  607. at org.junit.platform.engine.support.hierarchical.NodeTestTask.executeRecursively(NodeTestTask.java:126)
  608. at org.junit.platform.engine.support.hierarchical.NodeTestTask.execute(NodeTestTask.java:84)
  609. at java.base/java.util.ArrayList.forEach(ArrayList.java:1511)
  610. at org.junit.platform.engine.support.hierarchical.SameThreadHierarchicalTestExecutorService.invokeAll(SameThreadHierarchicalTestExecutorService.java:38)
  611. at org.junit.platform.engine.support.hierarchical.NodeTestTask.lambda$executeRecursively$5(NodeTestTask.java:143)
  612. at org.junit.platform.engine.support.hierarchical.ThrowableCollector.execute(ThrowableCollector.java:73)
  613. at org.junit.platform.engine.support.hierarchical.NodeTestTask.lambda$executeRecursively$7(NodeTestTask.java:129)
  614. at org.junit.platform.engine.support.hierarchical.Node.around(Node.java:137)
  615. at org.junit.platform.engine.support.hierarchical.NodeTestTask.lambda$executeRecursively$8(NodeTestTask.java:127)
  616. at org.junit.platform.engine.support.hierarchical.ThrowableCollector.execute(ThrowableCollector.java:73)
  617. at org.junit.platform.engine.support.hierarchical.NodeTestTask.executeRecursively(NodeTestTask.java:126)
  618. at org.junit.platform.engine.support.hierarchical.NodeTestTask.execute(NodeTestTask.java:84)
  619. at java.base/java.util.ArrayList.forEach(ArrayList.java:1511)
  620. at org.junit.platform.engine.support.hierarchical.SameThreadHierarchicalTestExecutorService.invokeAll(SameThreadHierarchicalTestExecutorService.java:38)
  621. at org.junit.platform.engine.support.hierarchical.NodeTestTask.lambda$executeRecursively$5(NodeTestTask.java:143)
  622. at org.junit.platform.engine.support.hierarchical.ThrowableCollector.execute(ThrowableCollector.java:73)
  623. at org.junit.platform.engine.support.hierarchical.NodeTestTask.lambda$executeRecursively$7(NodeTestTask.java:129)
  624. at org.junit.platform.engine.support.hierarchical.Node.around(Node.java:137)
  625. at org.junit.platform.engine.support.hierarchical.NodeTestTask.lambda$executeRecursively$8(NodeTestTask.java:127)
  626. at org.junit.platform.engine.support.hierarchical.ThrowableCollector.execute(ThrowableCollector.java:73)
  627. at org.junit.platform.engine.support.hierarchical.NodeTestTask.executeRecursively(NodeTestTask.java:126)
  628. at org.junit.platform.engine.support.hierarchical.NodeTestTask.execute(NodeTestTask.java:84)
  629. at org.junit.platform.engine.support.hierarchical.SameThreadHierarchicalTestExecutorService.submit(SameThreadHierarchicalTestExecutorService.java:32)
  630. at org.junit.platform.engine.support.hierarchical.HierarchicalTestExecutor.execute(HierarchicalTestExecutor.java:57)
  631. at org.junit.platform.engine.support.hierarchical.HierarchicalTestEngine.execute(HierarchicalTestEngine.java:51)
  632. at org.junit.platform.launcher.core.DefaultLauncher.execute(DefaultLauncher.java:220)
  633. at org.junit.platform.launcher.core.DefaultLauncher.lambda$execute$6(DefaultLauncher.java:188)
  634. at org.junit.platform.launcher.core.DefaultLauncher.withInterceptedStreams(DefaultLauncher.java:202)
  635. at org.junit.platform.launcher.core.DefaultLauncher.execute(DefaultLauncher.java:181)
  636. at org.junit.platform.launcher.core.DefaultLauncher.execute(DefaultLauncher.java:128)
  637. at org.apache.maven.surefire.junitplatform.JUnitPlatformProvider.invokeAllTests(JUnitPlatformProvider.java:150)
  638. at org.apache.maven.surefire.junitplatform.JUnitPlatformProvider.invoke(JUnitPlatformProvider.java:124)
  639. at org.apache.maven.surefire.booter.ForkedBooter.invokeProviderInSameClassLoader(ForkedBooter.java:384)
  640. at org.apache.maven.surefire.booter.ForkedBooter.runSuitesInProcess(ForkedBooter.java:345)
  641. at org.apache.maven.surefire.booter.ForkedBooter.execute(ForkedBooter.java:126)
  642. at org.apache.maven.surefire.booter.ForkedBooter.main(ForkedBooter.java:418)
  643. 16:02:57.623 [main] DEBUG org.springframework.web.servlet.mvc.method.annotation.HttpEntityMethodProcessor - Using 'application/json', given [*/*] and supported [application/json, application/*+json]
  644. 16:02:57.623 [main] DEBUG org.springframework.web.servlet.mvc.method.annotation.HttpEntityMethodProcessor - Writing [{msg=facility geometry source unavailable, code=500, data=com.zksy.cockpit.foundation.CockpitErrorPa (truncated)...]
  645. 16:02:57.624 [main] DEBUG org.springframework.web.servlet.mvc.method.annotation.ExceptionHandlerExceptionResolver - Resolved [com.zksy.cockpit.foundation.CockpitReadException: private database details]
  646. 16:02:57.624 [main] DEBUG org.springframework.test.web.servlet.TestDispatcherServlet - Completed 500 INTERNAL_SERVER_ERROR
  647. 16:02:57.625 [main] DEBUG com.jayway.jsonpath.internal.path.CompiledPath - Evaluating path: $['code']
  648. 16:02:57.625 [main] DEBUG com.jayway.jsonpath.internal.path.CompiledPath - Evaluating path: $['data']['category']
  649. 16:02:57.626 [main] DEBUG com.jayway.jsonpath.internal.path.CompiledPath - Evaluating path: $['data']['message']
  650. 16:02:57.626 [main] DEBUG com.jayway.jsonpath.internal.path.CompiledPath - Evaluating path: $['data']['requestId']
  651. [INFO] Tests run: 6, Failures: 0, Errors: 0, Skipped: 0, Time elapsed: 1.626 s - in com.zksy.web.controller.cockpit.CockpitFacilityGeometryControllerTest
  652. [INFO] Running com.zksy.web.controller.cockpit.CockpitFacilityGeometryServiceTest
  653. 16:02:57.707 [main] ERROR com.zksy.cockpit.geometry.CockpitFacilityGeometryService - Facility geometry source read failed
  654. java.lang.IllegalStateException: private database detail
  655. at com.zksy.cockpit.geometry.CockpitFacilityGeometryService.load(CockpitFacilityGeometryService.java:60)
  656. at org.junit.jupiter.api.AssertThrows.assertThrows(AssertThrows.java:55)
  657. at org.junit.jupiter.api.AssertThrows.assertThrows(AssertThrows.java:37)
  658. at org.junit.jupiter.api.Assertions.assertThrows(Assertions.java:3007)
  659. at com.zksy.web.controller.cockpit.CockpitFacilityGeometryServiceTest.aFailedSourceNeverProducesAnEmptyOrPartialSuccess(CockpitFacilityGeometryServiceTest.java:273)
  660. at java.base/jdk.internal.reflect.NativeMethodAccessorImpl.invoke0(Native Method)
  661. at java.base/jdk.internal.reflect.NativeMethodAccessorImpl.invoke(NativeMethodAccessorImpl.java:77)
  662. at java.base/jdk.internal.reflect.DelegatingMethodAccessorImpl.invoke(DelegatingMethodAccessorImpl.java:43)
  663. at java.base/java.lang.reflect.Method.invoke(Method.java:568)
  664. at org.junit.platform.commons.util.ReflectionUtils.invokeMethod(ReflectionUtils.java:688)
  665. at org.junit.jupiter.engine.execution.MethodInvocation.proceed(MethodInvocation.java:60)
  666. at org.junit.jupiter.engine.execution.InvocationInterceptorChain$ValidatingInvocation.proceed(InvocationInterceptorChain.java:131)
  667. at org.junit.jupiter.engine.extension.TimeoutExtension.intercept(TimeoutExtension.java:149)
  668. at org.junit.jupiter.engine.extension.TimeoutExtension.interceptTestableMethod(TimeoutExtension.java:140)
  669. at org.junit.jupiter.engine.extension.TimeoutExtension.interceptTestMethod(TimeoutExtension.java:84)
  670. at org.junit.jupiter.engine.execution.ExecutableInvoker$ReflectiveInterceptorCall.lambda$ofVoidMethod$0(ExecutableInvoker.java:115)
  671. at org.junit.jupiter.engine.execution.ExecutableInvoker.lambda$invoke$0(ExecutableInvoker.java:105)
  672. at org.junit.jupiter.engine.execution.InvocationInterceptorChain$InterceptedInvocation.proceed(InvocationInterceptorChain.java:106)
  673. at org.junit.jupiter.engine.execution.InvocationInterceptorChain.proceed(InvocationInterceptorChain.java:64)
  674. at org.junit.jupiter.engine.execution.InvocationInterceptorChain.chainAndInvoke(InvocationInterceptorChain.java:45)
  675. at org.junit.jupiter.engine.execution.InvocationInterceptorChain.invoke(InvocationInterceptorChain.java:37)
  676. at org.junit.jupiter.engine.execution.ExecutableInvoker.invoke(ExecutableInvoker.java:104)
  677. at org.junit.jupiter.engine.execution.ExecutableInvoker.invoke(ExecutableInvoker.java:98)
  678. at org.junit.jupiter.engine.descriptor.TestMethodTestDescriptor.lambda$invokeTestMethod$6(TestMethodTestDescriptor.java:210)
  679. at org.junit.platform.engine.support.hierarchical.ThrowableCollector.execute(ThrowableCollector.java:73)
  680. at org.junit.jupiter.engine.descriptor.TestMethodTestDescriptor.invokeTestMethod(TestMethodTestDescriptor.java:206)
  681. at org.junit.jupiter.engine.descriptor.TestMethodTestDescriptor.execute(TestMethodTestDescriptor.java:131)
  682. at org.junit.jupiter.engine.descriptor.TestMethodTestDescriptor.execute(TestMethodTestDescriptor.java:65)
  683. at org.junit.platform.engine.support.hierarchical.NodeTestTask.lambda$executeRecursively$5(NodeTestTask.java:139)
  684. at org.junit.platform.engine.support.hierarchical.ThrowableCollector.execute(ThrowableCollector.java:73)
  685. at org.junit.platform.engine.support.hierarchical.NodeTestTask.lambda$executeRecursively$7(NodeTestTask.java:129)
  686. at org.junit.platform.engine.support.hierarchical.Node.around(Node.java:137)
  687. at org.junit.platform.engine.support.hierarchical.NodeTestTask.lambda$executeRecursively$8(NodeTestTask.java:127)
  688. at org.junit.platform.engine.support.hierarchical.ThrowableCollector.execute(ThrowableCollector.java:73)
  689. at org.junit.platform.engine.support.hierarchical.NodeTestTask.executeRecursively(NodeTestTask.java:126)
  690. at org.junit.platform.engine.support.hierarchical.NodeTestTask.execute(NodeTestTask.java:84)
  691. at java.base/java.util.ArrayList.forEach(ArrayList.java:1511)
  692. at org.junit.platform.engine.support.hierarchical.SameThreadHierarchicalTestExecutorService.invokeAll(SameThreadHierarchicalTestExecutorService.java:38)
  693. at org.junit.platform.engine.support.hierarchical.NodeTestTask.lambda$executeRecursively$5(NodeTestTask.java:143)
  694. at org.junit.platform.engine.support.hierarchical.ThrowableCollector.execute(ThrowableCollector.java:73)
  695. at org.junit.platform.engine.support.hierarchical.NodeTestTask.lambda$executeRecursively$7(NodeTestTask.java:129)
  696. at org.junit.platform.engine.support.hierarchical.Node.around(Node.java:137)
  697. at org.junit.platform.engine.support.hierarchical.NodeTestTask.lambda$executeRecursively$8(NodeTestTask.java:127)
  698. at org.junit.platform.engine.support.hierarchical.ThrowableCollector.execute(ThrowableCollector.java:73)
  699. at org.junit.platform.engine.support.hierarchical.NodeTestTask.executeRecursively(NodeTestTask.java:126)
  700. at org.junit.platform.engine.support.hierarchical.NodeTestTask.execute(NodeTestTask.java:84)
  701. at java.base/java.util.ArrayList.forEach(ArrayList.java:1511)
  702. at org.junit.platform.engine.support.hierarchical.SameThreadHierarchicalTestExecutorService.invokeAll(SameThreadHierarchicalTestExecutorService.java:38)
  703. at org.junit.platform.engine.support.hierarchical.NodeTestTask.lambda$executeRecursively$5(NodeTestTask.java:143)
  704. at org.junit.platform.engine.support.hierarchical.ThrowableCollector.execute(ThrowableCollector.java:73)
  705. at org.junit.platform.engine.support.hierarchical.NodeTestTask.lambda$executeRecursively$7(NodeTestTask.java:129)
  706. at org.junit.platform.engine.support.hierarchical.Node.around(Node.java:137)
  707. at org.junit.platform.engine.support.hierarchical.NodeTestTask.lambda$executeRecursively$8(NodeTestTask.java:127)
  708. at org.junit.platform.engine.support.hierarchical.ThrowableCollector.execute(ThrowableCollector.java:73)
  709. at org.junit.platform.engine.support.hierarchical.NodeTestTask.executeRecursively(NodeTestTask.java:126)
  710. at org.junit.platform.engine.support.hierarchical.NodeTestTask.execute(NodeTestTask.java:84)
  711. at org.junit.platform.engine.support.hierarchical.SameThreadHierarchicalTestExecutorService.submit(SameThreadHierarchicalTestExecutorService.java:32)
  712. at org.junit.platform.engine.support.hierarchical.HierarchicalTestExecutor.execute(HierarchicalTestExecutor.java:57)
  713. at org.junit.platform.engine.support.hierarchical.HierarchicalTestEngine.execute(HierarchicalTestEngine.java:51)
  714. at org.junit.platform.launcher.core.DefaultLauncher.execute(DefaultLauncher.java:220)
  715. at org.junit.platform.launcher.core.DefaultLauncher.lambda$execute$6(DefaultLauncher.java:188)
  716. at org.junit.platform.launcher.core.DefaultLauncher.withInterceptedStreams(DefaultLauncher.java:202)
  717. at org.junit.platform.launcher.core.DefaultLauncher.execute(DefaultLauncher.java:181)
  718. at org.junit.platform.launcher.core.DefaultLauncher.execute(DefaultLauncher.java:128)
  719. at org.apache.maven.surefire.junitplatform.JUnitPlatformProvider.invokeAllTests(JUnitPlatformProvider.java:150)
  720. at org.apache.maven.surefire.junitplatform.JUnitPlatformProvider.invoke(JUnitPlatformProvider.java:124)
  721. at org.apache.maven.surefire.booter.ForkedBooter.invokeProviderInSameClassLoader(ForkedBooter.java:384)
  722. at org.apache.maven.surefire.booter.ForkedBooter.runSuitesInProcess(ForkedBooter.java:345)
  723. at org.apache.maven.surefire.booter.ForkedBooter.execute(ForkedBooter.java:126)
  724. at org.apache.maven.surefire.booter.ForkedBooter.main(ForkedBooter.java:418)
  725. 16:02:57.736 [main] ERROR com.zksy.cockpit.geometry.CockpitFacilityGeometryService - Facility geometry source read failed
  726. java.lang.NullPointerException: null
  727. at java.base/java.util.Objects.requireNonNull(Objects.java:208)
  728. at com.zksy.cockpit.geometry.CockpitFacilityGeometryService.load(CockpitFacilityGeometryService.java:66)
  729. at org.junit.jupiter.api.AssertThrows.assertThrows(AssertThrows.java:55)
  730. at org.junit.jupiter.api.AssertThrows.assertThrows(AssertThrows.java:37)
  731. at org.junit.jupiter.api.Assertions.assertThrows(Assertions.java:3007)
  732. at com.zksy.web.controller.cockpit.CockpitFacilityGeometryServiceTest.aNullSourceIsAReadFailureRatherThanASuccessfulEmptyCollection(CockpitFacilityGeometryServiceTest.java:281)
  733. at java.base/jdk.internal.reflect.NativeMethodAccessorImpl.invoke0(Native Method)
  734. at java.base/jdk.internal.reflect.NativeMethodAccessorImpl.invoke(NativeMethodAccessorImpl.java:77)
  735. at java.base/jdk.internal.reflect.DelegatingMethodAccessorImpl.invoke(DelegatingMethodAccessorImpl.java:43)
  736. at java.base/java.lang.reflect.Method.invoke(Method.java:568)
  737. at org.junit.platform.commons.util.ReflectionUtils.invokeMethod(ReflectionUtils.java:688)
  738. at org.junit.jupiter.engine.execution.MethodInvocation.proceed(MethodInvocation.java:60)
  739. at org.junit.jupiter.engine.execution.InvocationInterceptorChain$ValidatingInvocation.proceed(InvocationInterceptorChain.java:131)
  740. at org.junit.jupiter.engine.extension.TimeoutExtension.intercept(TimeoutExtension.java:149)
  741. at org.junit.jupiter.engine.extension.TimeoutExtension.interceptTestableMethod(TimeoutExtension.java:140)
  742. at org.junit.jupiter.engine.extension.TimeoutExtension.interceptTestMethod(TimeoutExtension.java:84)
  743. at org.junit.jupiter.engine.execution.ExecutableInvoker$ReflectiveInterceptorCall.lambda$ofVoidMethod$0(ExecutableInvoker.java:115)
  744. at org.junit.jupiter.engine.execution.ExecutableInvoker.lambda$invoke$0(ExecutableInvoker.java:105)
  745. at org.junit.jupiter.engine.execution.InvocationInterceptorChain$InterceptedInvocation.proceed(InvocationInterceptorChain.java:106)
  746. at org.junit.jupiter.engine.execution.InvocationInterceptorChain.proceed(InvocationInterceptorChain.java:64)
  747. at org.junit.jupiter.engine.execution.InvocationInterceptorChain.chainAndInvoke(InvocationInterceptorChain.java:45)
  748. at org.junit.jupiter.engine.execution.InvocationInterceptorChain.invoke(InvocationInterceptorChain.java:37)
  749. at org.junit.jupiter.engine.execution.ExecutableInvoker.invoke(ExecutableInvoker.java:104)
  750. at org.junit.jupiter.engine.execution.ExecutableInvoker.invoke(ExecutableInvoker.java:98)
  751. at org.junit.jupiter.engine.descriptor.TestMethodTestDescriptor.lambda$invokeTestMethod$6(TestMethodTestDescriptor.java:210)
  752. at org.junit.platform.engine.support.hierarchical.ThrowableCollector.execute(ThrowableCollector.java:73)
  753. at org.junit.jupiter.engine.descriptor.TestMethodTestDescriptor.invokeTestMethod(TestMethodTestDescriptor.java:206)
  754. at org.junit.jupiter.engine.descriptor.TestMethodTestDescriptor.execute(TestMethodTestDescriptor.java:131)
  755. at org.junit.jupiter.engine.descriptor.TestMethodTestDescriptor.execute(TestMethodTestDescriptor.java:65)
  756. at org.junit.platform.engine.support.hierarchical.NodeTestTask.lambda$executeRecursively$5(NodeTestTask.java:139)
  757. at org.junit.platform.engine.support.hierarchical.ThrowableCollector.execute(ThrowableCollector.java:73)
  758. at org.junit.platform.engine.support.hierarchical.NodeTestTask.lambda$executeRecursively$7(NodeTestTask.java:129)
  759. at org.junit.platform.engine.support.hierarchical.Node.around(Node.java:137)
  760. at org.junit.platform.engine.support.hierarchical.NodeTestTask.lambda$executeRecursively$8(NodeTestTask.java:127)
  761. at org.junit.platform.engine.support.hierarchical.ThrowableCollector.execute(ThrowableCollector.java:73)
  762. at org.junit.platform.engine.support.hierarchical.NodeTestTask.executeRecursively(NodeTestTask.java:126)
  763. at org.junit.platform.engine.support.hierarchical.NodeTestTask.execute(NodeTestTask.java:84)
  764. at java.base/java.util.ArrayList.forEach(ArrayList.java:1511)
  765. at org.junit.platform.engine.support.hierarchical.SameThreadHierarchicalTestExecutorService.invokeAll(SameThreadHierarchicalTestExecutorService.java:38)
  766. at org.junit.platform.engine.support.hierarchical.NodeTestTask.lambda$executeRecursively$5(NodeTestTask.java:143)
  767. at org.junit.platform.engine.support.hierarchical.ThrowableCollector.execute(ThrowableCollector.java:73)
  768. at org.junit.platform.engine.support.hierarchical.NodeTestTask.lambda$executeRecursively$7(NodeTestTask.java:129)
  769. at org.junit.platform.engine.support.hierarchical.Node.around(Node.java:137)
  770. at org.junit.platform.engine.support.hierarchical.NodeTestTask.lambda$executeRecursively$8(NodeTestTask.java:127)
  771. at org.junit.platform.engine.support.hierarchical.ThrowableCollector.execute(ThrowableCollector.java:73)
  772. at org.junit.platform.engine.support.hierarchical.NodeTestTask.executeRecursively(NodeTestTask.java:126)
  773. at org.junit.platform.engine.support.hierarchical.NodeTestTask.execute(NodeTestTask.java:84)
  774. at java.base/java.util.ArrayList.forEach(ArrayList.java:1511)
  775. at org.junit.platform.engine.support.hierarchical.SameThreadHierarchicalTestExecutorService.invokeAll(SameThreadHierarchicalTestExecutorService.java:38)
  776. at org.junit.platform.engine.support.hierarchical.NodeTestTask.lambda$executeRecursively$5(NodeTestTask.java:143)
  777. at org.junit.platform.engine.support.hierarchical.ThrowableCollector.execute(ThrowableCollector.java:73)
  778. at org.junit.platform.engine.support.hierarchical.NodeTestTask.lambda$executeRecursively$7(NodeTestTask.java:129)
  779. at org.junit.platform.engine.support.hierarchical.Node.around(Node.java:137)
  780. at org.junit.platform.engine.support.hierarchical.NodeTestTask.lambda$executeRecursively$8(NodeTestTask.java:127)
  781. at org.junit.platform.engine.support.hierarchical.ThrowableCollector.execute(ThrowableCollector.java:73)
  782. at org.junit.platform.engine.support.hierarchical.NodeTestTask.executeRecursively(NodeTestTask.java:126)
  783. at org.junit.platform.engine.support.hierarchical.NodeTestTask.execute(NodeTestTask.java:84)
  784. at org.junit.platform.engine.support.hierarchical.SameThreadHierarchicalTestExecutorService.submit(SameThreadHierarchicalTestExecutorService.java:32)
  785. at org.junit.platform.engine.support.hierarchical.HierarchicalTestExecutor.execute(HierarchicalTestExecutor.java:57)
  786. at org.junit.platform.engine.support.hierarchical.HierarchicalTestEngine.execute(HierarchicalTestEngine.java:51)
  787. at org.junit.platform.launcher.core.DefaultLauncher.execute(DefaultLauncher.java:220)
  788. at org.junit.platform.launcher.core.DefaultLauncher.lambda$execute$6(DefaultLauncher.java:188)
  789. at org.junit.platform.launcher.core.DefaultLauncher.withInterceptedStreams(DefaultLauncher.java:202)
  790. at org.junit.platform.launcher.core.DefaultLauncher.execute(DefaultLauncher.java:181)
  791. at org.junit.platform.launcher.core.DefaultLauncher.execute(DefaultLauncher.java:128)
  792. at org.apache.maven.surefire.junitplatform.JUnitPlatformProvider.invokeAllTests(JUnitPlatformProvider.java:150)
  793. at org.apache.maven.surefire.junitplatform.JUnitPlatformProvider.invoke(JUnitPlatformProvider.java:124)
  794. at org.apache.maven.surefire.booter.ForkedBooter.invokeProviderInSameClassLoader(ForkedBooter.java:384)
  795. at org.apache.maven.surefire.booter.ForkedBooter.runSuitesInProcess(ForkedBooter.java:345)
  796. at org.apache.maven.surefire.booter.ForkedBooter.execute(ForkedBooter.java:126)
  797. at org.apache.maven.surefire.booter.ForkedBooter.main(ForkedBooter.java:418)
  798. [ERROR] Tests run: 17, Failures: 0, Errors: 1, Skipped: 0, Time elapsed: 0.103 s <<< FAILURE! - in com.zksy.web.controller.cockpit.CockpitFacilityGeometryServiceTest
  799. [ERROR] exposesNetworkLevelForDrainageAndDefaultsLegacyMissingLevelWithoutMutatingSource Time elapsed: 0.02 s <<< ERROR!
  800. java.lang.NullPointerException: Cannot invoke "com.fasterxml.jackson.databind.JsonNode.asText()" because the return value of "com.fasterxml.jackson.databind.JsonNode.get(String)" is null
  801. at com.zksy.web.controller.cockpit.CockpitFacilityGeometryServiceTest.exposesNetworkLevelForDrainageAndDefaultsLegacyMissingLevelWithoutMutatingSource(CockpitFacilityGeometryServiceTest.java:149)
  802. [INFO]
  803. [INFO] Results:
  804. [INFO]
  805. [ERROR] Errors:
  806. [ERROR] CockpitFacilityGeometryServiceTest.exposesNetworkLevelForDrainageAndDefaultsLegacyMissingLevelWithoutMutatingSource:149 NullPointer
  807. [INFO]
  808. [ERROR] Tests run: 23, Failures: 0, Errors: 1, Skipped: 0
  809. [INFO]
  810. [INFO] ------------------------------------------------------------------------
  811. [INFO] Reactor Summary:
  812. [INFO]
  813. [INFO] pipe-ner-server 1.0.0 .............................. SUCCESS [ 0.003 s]
  814. [INFO] pipe-network-service 3.9.0 ......................... SUCCESS [ 0.001 s]
  815. [INFO] zksy-common 3.9.0 .................................. SUCCESS [ 1.029 s]
  816. [INFO] zksy-system 3.9.0 .................................. SUCCESS [ 12.419 s]
  817. [INFO] zksy-framework 3.9.0 ............................... SUCCESS [ 0.127 s]
  818. [INFO] zksy-quartz 3.9.0 .................................. SUCCESS [ 0.606 s]
  819. [INFO] zksy-generator 3.9.0 ............................... SUCCESS [ 0.065 s]
  820. [INFO] zksy-admin 3.9.0 ................................... FAILURE [ 7.288 s]
  821. [INFO] ------------------------------------------------------------------------
  822. [INFO] BUILD FAILURE
  823. [INFO] ------------------------------------------------------------------------
  824. [INFO] Total time: 22.016 s
  825. [INFO] Finished at: 2026-10-14T16:02:58+08:00
  826. [INFO] ------------------------------------------------------------------------
  827. [ERROR] Failed to execute goal org.apache.maven.plugins:maven-surefire-plugin:2.22.2:test (default-test) on project zksy-admin: There are test failures.
  828. [ERROR]
  829. [ERROR] Please refer to E:\pipe-ner-server\pipe-network-service\zksy-admin\target\surefire-reports for the individual test results.
  830. [ERROR] Please refer to dump files (if any exist) [date].dump, [date]-jvmRun[N].dump and [date].dumpstream.
  831. [ERROR] -> [Help 1]
  832. [ERROR]
  833. [ERROR] To see the full stack trace of the errors, re-run Maven with the -e switch.
  834. [ERROR] Re-run Maven using the -X switch to enable full debug logging.
  835. [ERROR]
  836. [ERROR] For more information about the errors and possible solutions, please read the following articles:
  837. [ERROR] [Help 1] http://cwiki.apache.org/confluence/display/MAVEN/MojoFailureException
  838. [ERROR]
  839. [ERROR] After correcting the problems, you can resume the build with the command
  840. [ERROR] mvn <args> -rf :zksy-admin