| 123456789101112131415161718192021222324252627282930313233343536373839404142434445464748495051525354555657585960616263646566676869707172737475767778798081828384858687888990919293949596979899100101102103104105106107108109110111112113114115116117118119120121122123124125126127128129130131132133134135136137138139140141142143144145146147148149150151152153154155156157158159160161162163164165166167168169170171172173174175176177178179180181182183184185186187188189190191192193194195196197198199200201202203204205206207208209210211212213214215216217218219220221222223224225226227228229230231232233234235236237238239240241242243244245246247248249250251252253254255256257258259260261262263264265266267268269270271272273274275276277278279280281282283284285286287288289290291292293294295296297298299300301302303304305306307308309310311312313314315316317318319320321322323324325326327328329330331332333334335336337338339340341342343344345346347348349350351352353354355356357358359360361362363364365366367368369370371372373374375376377378379380381382383384385386387388389390391392393394395396397398399400401402403404405406407408409410411412413414415416417418419420421422423424425426427428429430431432433434435436437438439440441442443444445446447448449450451452453454455456457458459460461462463464465466467468469470471472473474475476477478479480481482483484485486487488489490491492493494495496497498499500501502503504505506507508509510511512513514515516517518519520521522523524525526527528529530531532533534535536537538539540541542543544545546547548549550551552553554555556557558559560561562563564565566567568569570571572573574575576577578579580581582583584585586587588589590591592593594595596597598599600601602603604605606607608609610611612613614615616617618619620621622623624625626627628629630631632633634635636637638639640641642643644645646647648649650651652653654655656657658659660661662663664665666667668669670671672673674675676677678679680681682683684685686687688689690691692693694695696697698699700701702703704705706707708709710711712713714715716717718719720721722723724725726727728729730731732733734735736737738739740741742743744745746747748749750751752753754755756757758759760761762763764765766767768769770771772773774775776777778779780781782783784785786787788789790791792793794795796797798799800801802803804805806807808809810811812813814815 |
- [INFO] Scanning for projects...
- [INFO] ------------------------------------------------------------------------
- [INFO] Reactor Build Order:
- [INFO]
- [INFO] pipe-ner-server [pom]
- [INFO] pipe-network-service [pom]
- [INFO] zksy-common [jar]
- [INFO] zksy-system [jar]
- [INFO] zksy-framework [jar]
- [INFO] zksy-quartz [jar]
- [INFO] zksy-generator [jar]
- [INFO] zksy-admin [jar]
- [INFO]
- [INFO] ----------------------< com.zksy:pipe-ner-server >----------------------
- [INFO] Building pipe-ner-server 1.0.0 [1/8]
- [INFO] from pom.xml
- [INFO] --------------------------------[ pom ]---------------------------------
- [INFO]
- [INFO] -------------------< com.zksy:pipe-network-service >--------------------
- [INFO] Building pipe-network-service 3.9.0 [2/8]
- [INFO] from pipe-network-service\pom.xml
- [INFO] --------------------------------[ pom ]---------------------------------
- [INFO]
- [INFO] ------------------------< com.zksy:zksy-common >------------------------
- [INFO] Building zksy-common 3.9.0 [3/8]
- [INFO] from pipe-network-service\zksy-common\pom.xml
- [INFO] --------------------------------[ jar ]---------------------------------
- [WARNING] Parameter 'parameters' is unknown for plugin 'maven-compiler-plugin:3.1:compile (default-compile)'
- [WARNING] Parameter 'parameters' is unknown for plugin 'maven-compiler-plugin:3.1:testCompile (default-testCompile)'
- [INFO]
- [INFO] --- resources:3.2.0:resources (default-resources) @ zksy-common ---
- [INFO] Using 'UTF-8' encoding to copy filtered resources.
- [INFO] Using 'UTF-8' encoding to copy filtered properties files.
- [INFO] skip non existing resourceDirectory E:\pipe-ner-server\pipe-network-service\zksy-common\src\main\resources
- [INFO] skip non existing resourceDirectory E:\pipe-ner-server\pipe-network-service\zksy-common\src\main\resources
- [INFO]
- [INFO] --- compiler:3.1:compile (default-compile) @ zksy-common ---
- [INFO] Nothing to compile - all classes are up to date
- [INFO]
- [INFO] --- resources:3.2.0:testResources (default-testResources) @ zksy-common ---
- [INFO] Using 'UTF-8' encoding to copy filtered resources.
- [INFO] Using 'UTF-8' encoding to copy filtered properties files.
- [INFO] skip non existing resourceDirectory E:\pipe-ner-server\pipe-network-service\zksy-common\src\test\resources
- [INFO]
- [INFO] --- compiler:3.1:testCompile (default-testCompile) @ zksy-common ---
- [INFO] No sources to compile
- [INFO]
- [INFO] --- surefire:2.22.2:test (default-test) @ zksy-common ---
- [INFO] No tests to run.
- [INFO]
- [INFO] ------------------------< com.zksy:zksy-system >------------------------
- [INFO] Building zksy-system 3.9.0 [4/8]
- [INFO] from pipe-network-service\zksy-system\pom.xml
- [INFO] --------------------------------[ jar ]---------------------------------
- [WARNING] Parameter 'parameters' is unknown for plugin 'maven-compiler-plugin:3.1:compile (default-compile)'
- [WARNING] Parameter 'parameters' is unknown for plugin 'maven-compiler-plugin:3.1:testCompile (default-testCompile)'
- [INFO]
- [INFO] --- resources:3.2.0:resources (default-resources) @ zksy-system ---
- [INFO] Using 'UTF-8' encoding to copy filtered resources.
- [INFO] Using 'UTF-8' encoding to copy filtered properties files.
- [INFO] Copying 0 resource
- [INFO] Copying 46 resources
- [INFO]
- [INFO] --- compiler:3.1:compile (default-compile) @ zksy-system ---
- [INFO] Changes detected - recompiling the module!
- [INFO] Compiling 761 source files to E:\pipe-ner-server\pipe-network-service\zksy-system\target\classes
- [WARNING] /E:/pipe-ner-server/pipe-network-service/zksy-system/src/main/java/com/zksy/base/video/VideoCollectorClient.java: E:\pipe-ner-server\pipe-network-service\zksy-system\src\main\java\com\zksy\base\video\VideoCollectorClient.java使用了未经检查或不安全的操作。
- [WARNING] /E:/pipe-ner-server/pipe-network-service/zksy-system/src/main/java/com/zksy/base/video/VideoCollectorClient.java: 有关详细信息, 请使用 -Xlint:unchecked 重新编译。
- [INFO]
- [INFO] --- resources:3.2.0:testResources (default-testResources) @ zksy-system ---
- [INFO] Using 'UTF-8' encoding to copy filtered resources.
- [INFO] Using 'UTF-8' encoding to copy filtered properties files.
- [INFO] skip non existing resourceDirectory E:\pipe-ner-server\pipe-network-service\zksy-system\src\test\resources
- [INFO]
- [INFO] --- compiler:3.1:testCompile (default-testCompile) @ zksy-system ---
- [INFO] Nothing to compile - all classes are up to date
- [INFO]
- [INFO] --- surefire:2.22.2:test (default-test) @ zksy-system ---
- [INFO]
- [INFO] ----------------------< com.zksy:zksy-framework >-----------------------
- [INFO] Building zksy-framework 3.9.0 [5/8]
- [INFO] from pipe-network-service\zksy-framework\pom.xml
- [INFO] --------------------------------[ jar ]---------------------------------
- [WARNING] Parameter 'parameters' is unknown for plugin 'maven-compiler-plugin:3.1:compile (default-compile)'
- [WARNING] Parameter 'parameters' is unknown for plugin 'maven-compiler-plugin:3.1:testCompile (default-testCompile)'
- [INFO]
- [INFO] --- resources:3.2.0:resources (default-resources) @ zksy-framework ---
- [INFO] Using 'UTF-8' encoding to copy filtered resources.
- [INFO] Using 'UTF-8' encoding to copy filtered properties files.
- [INFO] skip non existing resourceDirectory E:\pipe-ner-server\pipe-network-service\zksy-framework\src\main\resources
- [INFO] skip non existing resourceDirectory E:\pipe-ner-server\pipe-network-service\zksy-framework\src\main\resources
- [INFO]
- [INFO] --- compiler:3.1:compile (default-compile) @ zksy-framework ---
- [INFO] Nothing to compile - all classes are up to date
- [INFO]
- [INFO] --- resources:3.2.0:testResources (default-testResources) @ zksy-framework ---
- [INFO] Using 'UTF-8' encoding to copy filtered resources.
- [INFO] Using 'UTF-8' encoding to copy filtered properties files.
- [INFO] skip non existing resourceDirectory E:\pipe-ner-server\pipe-network-service\zksy-framework\src\test\resources
- [INFO]
- [INFO] --- compiler:3.1:testCompile (default-testCompile) @ zksy-framework ---
- [INFO] No sources to compile
- [INFO]
- [INFO] --- surefire:2.22.2:test (default-test) @ zksy-framework ---
- [INFO] No tests to run.
- [INFO]
- [INFO] ------------------------< com.zksy:zksy-quartz >------------------------
- [INFO] Building zksy-quartz 3.9.0 [6/8]
- [INFO] from pipe-network-service\zksy-quartz\pom.xml
- [INFO] --------------------------------[ jar ]---------------------------------
- [WARNING] Parameter 'parameters' is unknown for plugin 'maven-compiler-plugin:3.1:compile (default-compile)'
- [WARNING] Parameter 'parameters' is unknown for plugin 'maven-compiler-plugin:3.1:testCompile (default-testCompile)'
- [INFO]
- [INFO] --- resources:3.2.0:resources (default-resources) @ zksy-quartz ---
- [INFO] Using 'UTF-8' encoding to copy filtered resources.
- [INFO] Using 'UTF-8' encoding to copy filtered properties files.
- [INFO] Copying 0 resource
- [INFO] Copying 2 resources
- [INFO]
- [INFO] --- compiler:3.1:compile (default-compile) @ zksy-quartz ---
- [INFO] Changes detected - recompiling the module!
- [INFO] Compiling 18 source files to E:\pipe-ner-server\pipe-network-service\zksy-quartz\target\classes
- [INFO]
- [INFO] --- resources:3.2.0:testResources (default-testResources) @ zksy-quartz ---
- [INFO] Using 'UTF-8' encoding to copy filtered resources.
- [INFO] Using 'UTF-8' encoding to copy filtered properties files.
- [INFO] skip non existing resourceDirectory E:\pipe-ner-server\pipe-network-service\zksy-quartz\src\test\resources
- [INFO]
- [INFO] --- compiler:3.1:testCompile (default-testCompile) @ zksy-quartz ---
- [INFO] No sources to compile
- [INFO]
- [INFO] --- surefire:2.22.2:test (default-test) @ zksy-quartz ---
- [INFO] No tests to run.
- [INFO]
- [INFO] ----------------------< com.zksy:zksy-generator >-----------------------
- [INFO] Building zksy-generator 3.9.0 [7/8]
- [INFO] from pipe-network-service\zksy-generator\pom.xml
- [INFO] --------------------------------[ jar ]---------------------------------
- [WARNING] Parameter 'parameters' is unknown for plugin 'maven-compiler-plugin:3.1:compile (default-compile)'
- [WARNING] Parameter 'parameters' is unknown for plugin 'maven-compiler-plugin:3.1:testCompile (default-testCompile)'
- [INFO]
- [INFO] --- resources:3.2.0:resources (default-resources) @ zksy-generator ---
- [INFO] Using 'UTF-8' encoding to copy filtered resources.
- [INFO] Using 'UTF-8' encoding to copy filtered properties files.
- [INFO] Copying 0 resource
- [INFO] Copying 16 resources
- [INFO]
- [INFO] --- compiler:3.1:compile (default-compile) @ zksy-generator ---
- [INFO] Nothing to compile - all classes are up to date
- [INFO]
- [INFO] --- resources:3.2.0:testResources (default-testResources) @ zksy-generator ---
- [INFO] Using 'UTF-8' encoding to copy filtered resources.
- [INFO] Using 'UTF-8' encoding to copy filtered properties files.
- [INFO] skip non existing resourceDirectory E:\pipe-ner-server\pipe-network-service\zksy-generator\src\test\resources
- [INFO]
- [INFO] --- compiler:3.1:testCompile (default-testCompile) @ zksy-generator ---
- [INFO] No sources to compile
- [INFO]
- [INFO] --- surefire:2.22.2:test (default-test) @ zksy-generator ---
- [INFO] No tests to run.
- [INFO]
- [INFO] ------------------------< com.zksy:zksy-admin >-------------------------
- [INFO] Building zksy-admin 3.9.0 [8/8]
- [INFO] from pipe-network-service\zksy-admin\pom.xml
- [INFO] --------------------------------[ jar ]---------------------------------
- [WARNING] Parameter 'parameters' is unknown for plugin 'maven-compiler-plugin:3.1:compile (default-compile)'
- [WARNING] Parameter 'parameters' is unknown for plugin 'maven-compiler-plugin:3.1:testCompile (default-testCompile)'
- [WARNING] 1 problem was encountered while building the effective model for org.javassist:javassist:jar:3.21.0-GA during dependency collection step for project (use -X to see details)
- [INFO]
- [INFO] --- resources:3.2.0:resources (default-resources) @ zksy-admin ---
- [INFO] Using 'UTF-8' encoding to copy filtered resources.
- [INFO] Using 'UTF-8' encoding to copy filtered properties files.
- [INFO] Copying 4 resources
- [INFO] Copying 6 resources
- [INFO]
- [INFO] --- compiler:3.1:compile (default-compile) @ zksy-admin ---
- [INFO] Changes detected - recompiling the module!
- [INFO] Compiling 146 source files to E:\pipe-ner-server\pipe-network-service\zksy-admin\target\classes
- [INFO]
- [INFO] --- resources:3.2.0:testResources (default-testResources) @ zksy-admin ---
- [INFO] Using 'UTF-8' encoding to copy filtered resources.
- [INFO] Using 'UTF-8' encoding to copy filtered properties files.
- [INFO] skip non existing resourceDirectory E:\pipe-ner-server\pipe-network-service\zksy-admin\src\test\resources
- [INFO]
- [INFO] --- compiler:3.1:testCompile (default-testCompile) @ zksy-admin ---
- [INFO] Changes detected - recompiling the module!
- [INFO] Compiling 67 source files to E:\pipe-ner-server\pipe-network-service\zksy-admin\target\test-classes
- [WARNING] /E:/pipe-ner-server/pipe-network-service/zksy-admin/src/test/java/com/zksy/web/controller/cockpit/BusinessCockpitOverviewWarningSettingsAdapterTest.java: 某些输入文件使用了未经检查或不安全的操作。
- [WARNING] /E:/pipe-ner-server/pipe-network-service/zksy-admin/src/test/java/com/zksy/web/controller/cockpit/BusinessCockpitOverviewWarningSettingsAdapterTest.java: 有关详细信息, 请使用 -Xlint:unchecked 重新编译。
- [INFO]
- [INFO] --- surefire:2.22.2:test (default-test) @ zksy-admin ---
- [INFO]
- [INFO] -------------------------------------------------------
- [INFO] T E S T S
- [INFO] -------------------------------------------------------
- [INFO] Running com.zksy.web.controller.cockpit.CockpitFacilityGeometryControllerTest
- 17:12:01.891 [main] DEBUG org.jboss.logging - Logging Provider: org.jboss.logging.Log4j2LoggerProvider
- 17:12:01.893 [main] INFO org.hibernate.validator.internal.util.Version - HV000001: Hibernate Validator 6.2.5.Final
- 17:12:01.908 [main] DEBUG org.hibernate.validator.messageinterpolation.ResourceBundleMessageInterpolator - Loaded expression factory via original TCCL
- 17:12:01.909 [main] DEBUG org.hibernate.validator.internal.engine.AbstractConfigurationImpl - Setting custom MessageInterpolator of type org.springframework.validation.beanvalidation.LocaleContextMessageInterpolator
- 17:12:01.909 [main] DEBUG org.hibernate.validator.internal.engine.AbstractConfigurationImpl - Setting custom ParameterNameProvider of type org.springframework.validation.beanvalidation.LocalValidatorFactoryBean$1
- 17:12:01.911 [main] DEBUG org.hibernate.validator.internal.xml.config.ValidationXmlParser - Trying to load META-INF/validation.xml for XML based Validator configuration.
- 17:12:01.912 [main] DEBUG org.hibernate.validator.internal.xml.config.ResourceLoaderHelper - Trying to load META-INF/validation.xml via TCCL
- 17:12:01.912 [main] DEBUG org.hibernate.validator.internal.xml.config.ResourceLoaderHelper - Trying to load META-INF/validation.xml via Hibernate Validator's class loader
- 17:12:01.912 [main] DEBUG org.hibernate.validator.internal.xml.config.ValidationXmlParser - No META-INF/validation.xml found. Using annotation based configuration only.
- 17:12:01.915 [main] DEBUG org.hibernate.validator.internal.engine.resolver.TraversableResolvers - Cannot find javax.persistence.Persistence on classpath. Assuming non JPA 2 environment. All properties will per default be traversable.
- 17:12:01.987 [main] DEBUG org.hibernate.validator.internal.engine.ValidatorFactoryConfigurationHelper - HV000252: Using org.hibernate.validator.internal.engine.DefaultPropertyNodeNameProvider as property node name provider.
- 17:12:01.993 [main] DEBUG org.hibernate.validator.internal.engine.ValidatorFactoryConfigurationHelper - HV000234: Using org.springframework.validation.beanvalidation.LocaleContextMessageInterpolator as ValidatorFactory-scoped message interpolator.
- 17:12:01.993 [main] DEBUG org.hibernate.validator.internal.engine.ValidatorFactoryConfigurationHelper - HV000234: Using org.hibernate.validator.internal.engine.resolver.TraverseAllTraversableResolver as ValidatorFactory-scoped traversable resolver.
- 17:12:01.993 [main] DEBUG org.hibernate.validator.internal.engine.ValidatorFactoryConfigurationHelper - HV000234: Using org.hibernate.validator.internal.util.ExecutableParameterNameProvider as ValidatorFactory-scoped parameter name provider.
- 17:12:01.993 [main] DEBUG org.hibernate.validator.internal.engine.ValidatorFactoryConfigurationHelper - HV000234: Using org.hibernate.validator.internal.engine.DefaultClockProvider as ValidatorFactory-scoped clock provider.
- 17:12:01.993 [main] DEBUG org.hibernate.validator.internal.engine.ValidatorFactoryConfigurationHelper - HV000234: Using org.hibernate.validator.internal.engine.scripting.DefaultScriptEvaluatorFactory as ValidatorFactory-scoped script evaluator factory.
- 17:12:02.067 [main] DEBUG _org.springframework.web.servlet.HandlerMapping.Mappings -
- c.z.w.c.c.CockpitFacilityGeometryController:
- {GET [/api/cockpit/v1/infrastructure/geometry]}: geometry()
- 17:12:02.070 [main] DEBUG org.springframework.web.servlet.mvc.method.annotation.RequestMappingHandlerMapping - 1 mappings in org.springframework.web.servlet.mvc.method.annotation.RequestMappingHandlerMapping
- 17:12:02.272 [main] DEBUG org.springframework.web.servlet.mvc.method.annotation.RequestMappingHandlerAdapter - ControllerAdvice beans: 0 @ModelAttribute, 0 @InitBinder, 1 RequestBodyAdvice, 1 ResponseBodyAdvice
- 17:12:02.294 [main] DEBUG org.springframework.web.servlet.mvc.method.annotation.ExceptionHandlerExceptionResolver - ControllerAdvice beans: 0 @ExceptionHandler, 1 ResponseBodyAdvice
- 17:12:02.312 [main] INFO org.springframework.mock.web.MockServletContext - Initializing Spring TestDispatcherServlet ''
- 17:12:02.312 [main] INFO org.springframework.test.web.servlet.TestDispatcherServlet - Initializing Servlet ''
- 17:12:02.314 [main] DEBUG org.springframework.test.web.servlet.TestDispatcherServlet - Detected AcceptHeaderLocaleResolver
- 17:12:02.314 [main] DEBUG org.springframework.test.web.servlet.TestDispatcherServlet - Detected FixedThemeResolver
- 17:12:02.314 [main] DEBUG org.springframework.test.web.servlet.TestDispatcherServlet - Detected org.springframework.web.servlet.view.DefaultRequestToViewNameTranslator@4462efe1
- 17:12:02.314 [main] DEBUG org.springframework.test.web.servlet.TestDispatcherServlet - Detected org.springframework.web.servlet.support.SessionFlashMapManager@7c3e4b1a
- 17:12:02.314 [main] DEBUG org.springframework.test.web.servlet.TestDispatcherServlet - enableLoggingRequestDetails='false': request parameters and headers will be masked to prevent unsafe logging of potentially sensitive data
- 17:12:02.314 [main] INFO org.springframework.test.web.servlet.TestDispatcherServlet - Completed initialization in 2 ms
- 17:12:02.582 [main] DEBUG org.springframework.test.web.servlet.TestDispatcherServlet - GET "/api/cockpit/v1/infrastructure/geometry", parameters={}
- 17:12:02.585 [main] DEBUG org.springframework.web.servlet.mvc.method.annotation.RequestMappingHandlerMapping - Mapped to com.zksy.web.controller.cockpit.CockpitFacilityGeometryController#geometry()
- 17:12:02.619 [main] DEBUG org.springframework.web.servlet.mvc.method.annotation.HttpEntityMethodProcessor - Using 'application/json', given [*/*] and supported [application/json, application/*+json]
- 17:12:02.620 [main] DEBUG org.springframework.web.servlet.mvc.method.annotation.HttpEntityMethodProcessor - Writing [{msg=操作成功, code=200, data=com.zksy.cockpit.geometry.CockpitFacilityGeometryResponse@2c3158e0}]
- 17:12:02.638 [main] DEBUG org.springframework.test.web.servlet.TestDispatcherServlet - Completed 200 OK
- 17:12:02.670 [main] DEBUG com.jayway.jsonpath.internal.path.CompiledPath - Evaluating path: $['code']
- 17:12:02.675 [main] DEBUG com.jayway.jsonpath.internal.path.CompiledPath - Evaluating path: $['data']['type']
- 17:12:02.678 [main] DEBUG com.jayway.jsonpath.internal.path.CompiledPath - Evaluating path: $['data']['features']
- 17:12:02.678 [main] DEBUG com.jayway.jsonpath.internal.path.CompiledPath - Evaluating path: $['data']['coverage']
- 17:12:02.679 [main] DEBUG com.jayway.jsonpath.internal.path.CompiledPath - Evaluating path: $['data']['coverage'][4]['state']
- 17:12:02.684 [main] DEBUG org.hibernate.validator.messageinterpolation.ResourceBundleMessageInterpolator - Loaded expression factory via original TCCL
- 17:12:02.684 [main] DEBUG org.hibernate.validator.internal.engine.AbstractConfigurationImpl - Setting custom MessageInterpolator of type org.springframework.validation.beanvalidation.LocaleContextMessageInterpolator
- 17:12:02.684 [main] DEBUG org.hibernate.validator.internal.engine.AbstractConfigurationImpl - Setting custom ParameterNameProvider of type org.springframework.validation.beanvalidation.LocalValidatorFactoryBean$1
- 17:12:02.684 [main] DEBUG org.hibernate.validator.internal.xml.config.ValidationXmlParser - Trying to load META-INF/validation.xml for XML based Validator configuration.
- 17:12:02.684 [main] DEBUG org.hibernate.validator.internal.xml.config.ResourceLoaderHelper - Trying to load META-INF/validation.xml via TCCL
- 17:12:02.684 [main] DEBUG org.hibernate.validator.internal.xml.config.ResourceLoaderHelper - Trying to load META-INF/validation.xml via Hibernate Validator's class loader
- 17:12:02.684 [main] DEBUG org.hibernate.validator.internal.xml.config.ValidationXmlParser - No META-INF/validation.xml found. Using annotation based configuration only.
- 17:12:02.685 [main] DEBUG org.hibernate.validator.internal.engine.resolver.TraversableResolvers - Cannot find javax.persistence.Persistence on classpath. Assuming non JPA 2 environment. All properties will per default be traversable.
- 17:12:02.686 [main] DEBUG org.hibernate.validator.internal.engine.ValidatorFactoryConfigurationHelper - HV000252: Using org.hibernate.validator.internal.engine.DefaultPropertyNodeNameProvider as property node name provider.
- 17:12:02.686 [main] DEBUG org.hibernate.validator.internal.engine.ValidatorFactoryConfigurationHelper - HV000234: Using org.springframework.validation.beanvalidation.LocaleContextMessageInterpolator as ValidatorFactory-scoped message interpolator.
- 17:12:02.686 [main] DEBUG org.hibernate.validator.internal.engine.ValidatorFactoryConfigurationHelper - HV000234: Using org.hibernate.validator.internal.engine.resolver.TraverseAllTraversableResolver as ValidatorFactory-scoped traversable resolver.
- 17:12:02.686 [main] DEBUG org.hibernate.validator.internal.engine.ValidatorFactoryConfigurationHelper - HV000234: Using org.hibernate.validator.internal.util.ExecutableParameterNameProvider as ValidatorFactory-scoped parameter name provider.
- 17:12:02.686 [main] DEBUG org.hibernate.validator.internal.engine.ValidatorFactoryConfigurationHelper - HV000234: Using org.hibernate.validator.internal.engine.DefaultClockProvider as ValidatorFactory-scoped clock provider.
- 17:12:02.686 [main] DEBUG org.hibernate.validator.internal.engine.ValidatorFactoryConfigurationHelper - HV000234: Using org.hibernate.validator.internal.engine.scripting.DefaultScriptEvaluatorFactory as ValidatorFactory-scoped script evaluator factory.
- 17:12:02.688 [main] DEBUG _org.springframework.web.servlet.HandlerMapping.Mappings -
- c.z.w.c.c.CockpitFacilityGeometryController:
- {GET [/api/cockpit/v1/infrastructure/geometry]}: geometry()
- 17:12:02.688 [main] DEBUG org.springframework.web.servlet.mvc.method.annotation.RequestMappingHandlerMapping - 1 mappings in org.springframework.web.servlet.mvc.method.annotation.RequestMappingHandlerMapping
- 17:12:02.693 [main] DEBUG org.springframework.web.servlet.mvc.method.annotation.RequestMappingHandlerAdapter - ControllerAdvice beans: 0 @ModelAttribute, 0 @InitBinder, 1 RequestBodyAdvice, 1 ResponseBodyAdvice
- 17:12:02.694 [main] DEBUG org.springframework.web.servlet.mvc.method.annotation.ExceptionHandlerExceptionResolver - ControllerAdvice beans: 0 @ExceptionHandler, 1 ResponseBodyAdvice
- 17:12:02.694 [main] INFO org.springframework.mock.web.MockServletContext - Initializing Spring TestDispatcherServlet ''
- 17:12:02.694 [main] INFO org.springframework.test.web.servlet.TestDispatcherServlet - Initializing Servlet ''
- 17:12:02.694 [main] DEBUG org.springframework.test.web.servlet.TestDispatcherServlet - Detected AcceptHeaderLocaleResolver
- 17:12:02.694 [main] DEBUG org.springframework.test.web.servlet.TestDispatcherServlet - Detected FixedThemeResolver
- 17:12:02.694 [main] DEBUG org.springframework.test.web.servlet.TestDispatcherServlet - Detected org.springframework.web.servlet.view.DefaultRequestToViewNameTranslator@526f6427
- 17:12:02.694 [main] DEBUG org.springframework.test.web.servlet.TestDispatcherServlet - Detected org.springframework.web.servlet.support.SessionFlashMapManager@4f1afe8f
- 17:12:02.694 [main] DEBUG org.springframework.test.web.servlet.TestDispatcherServlet - enableLoggingRequestDetails='false': request parameters and headers will be masked to prevent unsafe logging of potentially sensitive data
- 17:12:02.694 [main] INFO org.springframework.test.web.servlet.TestDispatcherServlet - Completed initialization in 0 ms
- 17:12:02.695 [main] DEBUG org.springframework.test.web.servlet.TestDispatcherServlet - GET "/api/cockpit/v1/infrastructure/geometry", parameters={}
- 17:12:02.695 [main] DEBUG org.springframework.web.servlet.mvc.method.annotation.RequestMappingHandlerMapping - Mapped to com.zksy.web.controller.cockpit.CockpitFacilityGeometryController#geometry()
- 17:12:02.696 [main] DEBUG org.springframework.web.servlet.mvc.method.annotation.HttpEntityMethodProcessor - Using 'application/json', given [*/*] and supported [application/json, application/*+json]
- 17:12:02.696 [main] DEBUG org.springframework.web.servlet.mvc.method.annotation.HttpEntityMethodProcessor - Writing [{msg=操作成功, code=200, data=com.zksy.cockpit.geometry.CockpitFacilityGeometryResponse@752b69e3}]
- 17:12:02.704 [main] DEBUG org.springframework.test.web.servlet.TestDispatcherServlet - Completed 200 OK
- 17:12:02.705 [main] DEBUG com.jayway.jsonpath.internal.path.CompiledPath - Evaluating path: $['data']['features'][0]['type']
- 17:12:02.705 [main] DEBUG com.jayway.jsonpath.internal.path.CompiledPath - Evaluating path: $['data']['features'][0]['geometry']
- 17:12:02.706 [main] DEBUG com.jayway.jsonpath.internal.path.CompiledPath - Evaluating path: $['data']['features'][0]['properties']['networkId']
- 17:12:02.706 [main] DEBUG com.jayway.jsonpath.internal.path.CompiledPath - Evaluating path: $['data']['features'][0]['properties']['pointType']
- 17:12:02.706 [main] DEBUG com.jayway.jsonpath.internal.path.CompiledPath - Evaluating path: $['data']['features'][0]['properties']['sourceCoordinates'][0][0]
- 17:12:02.706 [main] DEBUG com.jayway.jsonpath.internal.path.CompiledPath - Evaluating path: $['data']['features'][0]['properties']['coordinateValidation']['state']
- 17:12:02.707 [main] DEBUG com.jayway.jsonpath.internal.path.CompiledPath - Evaluating path: $['data']['features'][0]['properties']['coordinateValidation']['reason']
- 17:12:02.707 [main] DEBUG com.jayway.jsonpath.internal.path.CompiledPath - Evaluating path: $['data']['features'][0]['properties']['coordinateValidation']['renderable']
- 17:12:02.707 [main] DEBUG com.jayway.jsonpath.internal.path.CompiledPath - Evaluating path: $['data']['features'][0]['properties']['coordinateValidation']['crs']
- 17:12:02.709 [main] DEBUG org.hibernate.validator.messageinterpolation.ResourceBundleMessageInterpolator - Loaded expression factory via original TCCL
- 17:12:02.709 [main] DEBUG org.hibernate.validator.internal.engine.AbstractConfigurationImpl - Setting custom MessageInterpolator of type org.springframework.validation.beanvalidation.LocaleContextMessageInterpolator
- 17:12:02.709 [main] DEBUG org.hibernate.validator.internal.engine.AbstractConfigurationImpl - Setting custom ParameterNameProvider of type org.springframework.validation.beanvalidation.LocalValidatorFactoryBean$1
- 17:12:02.709 [main] DEBUG org.hibernate.validator.internal.xml.config.ValidationXmlParser - Trying to load META-INF/validation.xml for XML based Validator configuration.
- 17:12:02.709 [main] DEBUG org.hibernate.validator.internal.xml.config.ResourceLoaderHelper - Trying to load META-INF/validation.xml via TCCL
- 17:12:02.709 [main] DEBUG org.hibernate.validator.internal.xml.config.ResourceLoaderHelper - Trying to load META-INF/validation.xml via Hibernate Validator's class loader
- 17:12:02.710 [main] DEBUG org.hibernate.validator.internal.xml.config.ValidationXmlParser - No META-INF/validation.xml found. Using annotation based configuration only.
- 17:12:02.710 [main] DEBUG org.hibernate.validator.internal.engine.resolver.TraversableResolvers - Cannot find javax.persistence.Persistence on classpath. Assuming non JPA 2 environment. All properties will per default be traversable.
- 17:12:02.711 [main] DEBUG org.hibernate.validator.internal.engine.ValidatorFactoryConfigurationHelper - HV000252: Using org.hibernate.validator.internal.engine.DefaultPropertyNodeNameProvider as property node name provider.
- 17:12:02.711 [main] DEBUG org.hibernate.validator.internal.engine.ValidatorFactoryConfigurationHelper - HV000234: Using org.springframework.validation.beanvalidation.LocaleContextMessageInterpolator as ValidatorFactory-scoped message interpolator.
- 17:12:02.711 [main] DEBUG org.hibernate.validator.internal.engine.ValidatorFactoryConfigurationHelper - HV000234: Using org.hibernate.validator.internal.engine.resolver.TraverseAllTraversableResolver as ValidatorFactory-scoped traversable resolver.
- 17:12:02.711 [main] DEBUG org.hibernate.validator.internal.engine.ValidatorFactoryConfigurationHelper - HV000234: Using org.hibernate.validator.internal.util.ExecutableParameterNameProvider as ValidatorFactory-scoped parameter name provider.
- 17:12:02.711 [main] DEBUG org.hibernate.validator.internal.engine.ValidatorFactoryConfigurationHelper - HV000234: Using org.hibernate.validator.internal.engine.DefaultClockProvider as ValidatorFactory-scoped clock provider.
- 17:12:02.711 [main] DEBUG org.hibernate.validator.internal.engine.ValidatorFactoryConfigurationHelper - HV000234: Using org.hibernate.validator.internal.engine.scripting.DefaultScriptEvaluatorFactory as ValidatorFactory-scoped script evaluator factory.
- 17:12:02.712 [main] DEBUG _org.springframework.web.servlet.HandlerMapping.Mappings -
- c.z.w.c.c.CockpitFacilityGeometryController:
- {GET [/api/cockpit/v1/infrastructure/geometry]}: geometry()
- 17:12:02.712 [main] DEBUG org.springframework.web.servlet.mvc.method.annotation.RequestMappingHandlerMapping - 1 mappings in org.springframework.web.servlet.mvc.method.annotation.RequestMappingHandlerMapping
- 17:12:02.715 [main] DEBUG org.springframework.web.servlet.mvc.method.annotation.RequestMappingHandlerAdapter - ControllerAdvice beans: 0 @ModelAttribute, 0 @InitBinder, 1 RequestBodyAdvice, 1 ResponseBodyAdvice
- 17:12:02.716 [main] DEBUG org.springframework.web.servlet.mvc.method.annotation.ExceptionHandlerExceptionResolver - ControllerAdvice beans: 0 @ExceptionHandler, 1 ResponseBodyAdvice
- 17:12:02.716 [main] INFO org.springframework.mock.web.MockServletContext - Initializing Spring TestDispatcherServlet ''
- 17:12:02.716 [main] INFO org.springframework.test.web.servlet.TestDispatcherServlet - Initializing Servlet ''
- 17:12:02.716 [main] DEBUG org.springframework.test.web.servlet.TestDispatcherServlet - Detected AcceptHeaderLocaleResolver
- 17:12:02.716 [main] DEBUG org.springframework.test.web.servlet.TestDispatcherServlet - Detected FixedThemeResolver
- 17:12:02.716 [main] DEBUG org.springframework.test.web.servlet.TestDispatcherServlet - Detected org.springframework.web.servlet.view.DefaultRequestToViewNameTranslator@48d739f
- 17:12:02.716 [main] DEBUG org.springframework.test.web.servlet.TestDispatcherServlet - Detected org.springframework.web.servlet.support.SessionFlashMapManager@51e7589f
- 17:12:02.716 [main] DEBUG org.springframework.test.web.servlet.TestDispatcherServlet - enableLoggingRequestDetails='false': request parameters and headers will be masked to prevent unsafe logging of potentially sensitive data
- 17:12:02.716 [main] INFO org.springframework.test.web.servlet.TestDispatcherServlet - Completed initialization in 0 ms
- 17:12:02.716 [main] DEBUG org.springframework.test.web.servlet.TestDispatcherServlet - POST "/api/cockpit/v1/infrastructure/geometry", parameters={}
- 17:12:02.717 [main] WARN org.springframework.web.servlet.mvc.support.DefaultHandlerExceptionResolver - Resolved [org.springframework.web.HttpRequestMethodNotSupportedException: Request method 'POST' not supported]
- 17:12:02.717 [main] DEBUG org.springframework.test.web.servlet.TestDispatcherServlet - Completed 405 METHOD_NOT_ALLOWED
- 17:12:02.720 [main] DEBUG org.hibernate.validator.messageinterpolation.ResourceBundleMessageInterpolator - Loaded expression factory via original TCCL
- 17:12:02.721 [main] DEBUG org.hibernate.validator.internal.engine.AbstractConfigurationImpl - Setting custom MessageInterpolator of type org.springframework.validation.beanvalidation.LocaleContextMessageInterpolator
- 17:12:02.721 [main] DEBUG org.hibernate.validator.internal.engine.AbstractConfigurationImpl - Setting custom ParameterNameProvider of type org.springframework.validation.beanvalidation.LocalValidatorFactoryBean$1
- 17:12:02.721 [main] DEBUG org.hibernate.validator.internal.xml.config.ValidationXmlParser - Trying to load META-INF/validation.xml for XML based Validator configuration.
- 17:12:02.721 [main] DEBUG org.hibernate.validator.internal.xml.config.ResourceLoaderHelper - Trying to load META-INF/validation.xml via TCCL
- 17:12:02.722 [main] DEBUG org.hibernate.validator.internal.xml.config.ResourceLoaderHelper - Trying to load META-INF/validation.xml via Hibernate Validator's class loader
- 17:12:02.722 [main] DEBUG org.hibernate.validator.internal.xml.config.ValidationXmlParser - No META-INF/validation.xml found. Using annotation based configuration only.
- 17:12:02.722 [main] DEBUG org.hibernate.validator.internal.engine.resolver.TraversableResolvers - Cannot find javax.persistence.Persistence on classpath. Assuming non JPA 2 environment. All properties will per default be traversable.
- 17:12:02.723 [main] DEBUG org.hibernate.validator.internal.engine.ValidatorFactoryConfigurationHelper - HV000252: Using org.hibernate.validator.internal.engine.DefaultPropertyNodeNameProvider as property node name provider.
- 17:12:02.723 [main] DEBUG org.hibernate.validator.internal.engine.ValidatorFactoryConfigurationHelper - HV000234: Using org.springframework.validation.beanvalidation.LocaleContextMessageInterpolator as ValidatorFactory-scoped message interpolator.
- 17:12:02.723 [main] DEBUG org.hibernate.validator.internal.engine.ValidatorFactoryConfigurationHelper - HV000234: Using org.hibernate.validator.internal.engine.resolver.TraverseAllTraversableResolver as ValidatorFactory-scoped traversable resolver.
- 17:12:02.723 [main] DEBUG org.hibernate.validator.internal.engine.ValidatorFactoryConfigurationHelper - HV000234: Using org.hibernate.validator.internal.util.ExecutableParameterNameProvider as ValidatorFactory-scoped parameter name provider.
- 17:12:02.723 [main] DEBUG org.hibernate.validator.internal.engine.ValidatorFactoryConfigurationHelper - HV000234: Using org.hibernate.validator.internal.engine.DefaultClockProvider as ValidatorFactory-scoped clock provider.
- 17:12:02.723 [main] DEBUG org.hibernate.validator.internal.engine.ValidatorFactoryConfigurationHelper - HV000234: Using org.hibernate.validator.internal.engine.scripting.DefaultScriptEvaluatorFactory as ValidatorFactory-scoped script evaluator factory.
- 17:12:02.724 [main] DEBUG _org.springframework.web.servlet.HandlerMapping.Mappings -
- c.z.w.c.c.CockpitFacilityGeometryController:
- {GET [/api/cockpit/v1/infrastructure/geometry]}: geometry()
- 17:12:02.725 [main] DEBUG org.springframework.web.servlet.mvc.method.annotation.RequestMappingHandlerMapping - 1 mappings in org.springframework.web.servlet.mvc.method.annotation.RequestMappingHandlerMapping
- 17:12:02.727 [main] DEBUG org.springframework.web.servlet.mvc.method.annotation.RequestMappingHandlerAdapter - ControllerAdvice beans: 0 @ModelAttribute, 0 @InitBinder, 1 RequestBodyAdvice, 1 ResponseBodyAdvice
- 17:12:02.729 [main] DEBUG org.springframework.web.servlet.mvc.method.annotation.ExceptionHandlerExceptionResolver - ControllerAdvice beans: 0 @ExceptionHandler, 1 ResponseBodyAdvice
- 17:12:02.729 [main] INFO org.springframework.mock.web.MockServletContext - Initializing Spring TestDispatcherServlet ''
- 17:12:02.729 [main] INFO org.springframework.test.web.servlet.TestDispatcherServlet - Initializing Servlet ''
- 17:12:02.729 [main] DEBUG org.springframework.test.web.servlet.TestDispatcherServlet - Detected AcceptHeaderLocaleResolver
- 17:12:02.729 [main] DEBUG org.springframework.test.web.servlet.TestDispatcherServlet - Detected FixedThemeResolver
- 17:12:02.729 [main] DEBUG org.springframework.test.web.servlet.TestDispatcherServlet - Detected org.springframework.web.servlet.view.DefaultRequestToViewNameTranslator@7b9088f2
- 17:12:02.729 [main] DEBUG org.springframework.test.web.servlet.TestDispatcherServlet - Detected org.springframework.web.servlet.support.SessionFlashMapManager@1a914089
- 17:12:02.729 [main] DEBUG org.springframework.test.web.servlet.TestDispatcherServlet - enableLoggingRequestDetails='false': request parameters and headers will be masked to prevent unsafe logging of potentially sensitive data
- 17:12:02.729 [main] INFO org.springframework.test.web.servlet.TestDispatcherServlet - Completed initialization in 0 ms
- 17:12:02.731 [main] DEBUG org.hibernate.validator.messageinterpolation.ResourceBundleMessageInterpolator - Loaded expression factory via original TCCL
- 17:12:02.731 [main] DEBUG org.hibernate.validator.internal.engine.AbstractConfigurationImpl - Setting custom MessageInterpolator of type org.springframework.validation.beanvalidation.LocaleContextMessageInterpolator
- 17:12:02.731 [main] DEBUG org.hibernate.validator.internal.engine.AbstractConfigurationImpl - Setting custom ParameterNameProvider of type org.springframework.validation.beanvalidation.LocalValidatorFactoryBean$1
- 17:12:02.731 [main] DEBUG org.hibernate.validator.internal.xml.config.ValidationXmlParser - Trying to load META-INF/validation.xml for XML based Validator configuration.
- 17:12:02.731 [main] DEBUG org.hibernate.validator.internal.xml.config.ResourceLoaderHelper - Trying to load META-INF/validation.xml via TCCL
- 17:12:02.731 [main] DEBUG org.hibernate.validator.internal.xml.config.ResourceLoaderHelper - Trying to load META-INF/validation.xml via Hibernate Validator's class loader
- 17:12:02.731 [main] DEBUG org.hibernate.validator.internal.xml.config.ValidationXmlParser - No META-INF/validation.xml found. Using annotation based configuration only.
- 17:12:02.731 [main] DEBUG org.hibernate.validator.internal.engine.resolver.TraversableResolvers - Cannot find javax.persistence.Persistence on classpath. Assuming non JPA 2 environment. All properties will per default be traversable.
- 17:12:02.732 [main] DEBUG org.hibernate.validator.internal.engine.ValidatorFactoryConfigurationHelper - HV000252: Using org.hibernate.validator.internal.engine.DefaultPropertyNodeNameProvider as property node name provider.
- 17:12:02.732 [main] DEBUG org.hibernate.validator.internal.engine.ValidatorFactoryConfigurationHelper - HV000234: Using org.springframework.validation.beanvalidation.LocaleContextMessageInterpolator as ValidatorFactory-scoped message interpolator.
- 17:12:02.732 [main] DEBUG org.hibernate.validator.internal.engine.ValidatorFactoryConfigurationHelper - HV000234: Using org.hibernate.validator.internal.engine.resolver.TraverseAllTraversableResolver as ValidatorFactory-scoped traversable resolver.
- 17:12:02.732 [main] DEBUG org.hibernate.validator.internal.engine.ValidatorFactoryConfigurationHelper - HV000234: Using org.hibernate.validator.internal.util.ExecutableParameterNameProvider as ValidatorFactory-scoped parameter name provider.
- 17:12:02.732 [main] DEBUG org.hibernate.validator.internal.engine.ValidatorFactoryConfigurationHelper - HV000234: Using org.hibernate.validator.internal.engine.DefaultClockProvider as ValidatorFactory-scoped clock provider.
- 17:12:02.732 [main] DEBUG org.hibernate.validator.internal.engine.ValidatorFactoryConfigurationHelper - HV000234: Using org.hibernate.validator.internal.engine.scripting.DefaultScriptEvaluatorFactory as ValidatorFactory-scoped script evaluator factory.
- 17:12:02.733 [main] DEBUG _org.springframework.web.servlet.HandlerMapping.Mappings -
- c.z.w.c.c.CockpitFacilityGeometryController:
- {GET [/api/cockpit/v1/infrastructure/geometry]}: geometry()
- 17:12:02.733 [main] DEBUG org.springframework.web.servlet.mvc.method.annotation.RequestMappingHandlerMapping - 1 mappings in org.springframework.web.servlet.mvc.method.annotation.RequestMappingHandlerMapping
- 17:12:02.737 [main] DEBUG org.springframework.web.servlet.mvc.method.annotation.RequestMappingHandlerAdapter - ControllerAdvice beans: 0 @ModelAttribute, 0 @InitBinder, 1 RequestBodyAdvice, 1 ResponseBodyAdvice
- 17:12:02.740 [main] DEBUG org.springframework.web.servlet.mvc.method.annotation.ExceptionHandlerExceptionResolver - ControllerAdvice beans: 0 @ExceptionHandler, 1 ResponseBodyAdvice
- 17:12:02.740 [main] INFO org.springframework.mock.web.MockServletContext - Initializing Spring TestDispatcherServlet ''
- 17:12:02.740 [main] INFO org.springframework.test.web.servlet.TestDispatcherServlet - Initializing Servlet ''
- 17:12:02.740 [main] DEBUG org.springframework.test.web.servlet.TestDispatcherServlet - Detected AcceptHeaderLocaleResolver
- 17:12:02.740 [main] DEBUG org.springframework.test.web.servlet.TestDispatcherServlet - Detected FixedThemeResolver
- 17:12:02.740 [main] DEBUG org.springframework.test.web.servlet.TestDispatcherServlet - Detected org.springframework.web.servlet.view.DefaultRequestToViewNameTranslator@79df80a4
- 17:12:02.740 [main] DEBUG org.springframework.test.web.servlet.TestDispatcherServlet - Detected org.springframework.web.servlet.support.SessionFlashMapManager@130cfc47
- 17:12:02.740 [main] DEBUG org.springframework.test.web.servlet.TestDispatcherServlet - enableLoggingRequestDetails='false': request parameters and headers will be masked to prevent unsafe logging of potentially sensitive data
- 17:12:02.740 [main] INFO org.springframework.test.web.servlet.TestDispatcherServlet - Completed initialization in 0 ms
- 17:12:02.740 [main] DEBUG org.springframework.test.web.servlet.TestDispatcherServlet - GET "/api/cockpit/v1/infrastructure/geometry", parameters={}
- 17:12:02.741 [main] DEBUG org.springframework.web.servlet.mvc.method.annotation.RequestMappingHandlerMapping - Mapped to com.zksy.web.controller.cockpit.CockpitFacilityGeometryController#geometry()
- 17:12:02.744 [main] DEBUG org.springframework.web.servlet.mvc.method.annotation.HttpEntityMethodProcessor - Using 'application/json', given [*/*] and supported [application/json, application/*+json]
- 17:12:02.744 [main] DEBUG org.springframework.web.servlet.mvc.method.annotation.HttpEntityMethodProcessor - Writing [{msg=操作成功, code=200, data=com.zksy.cockpit.geometry.CockpitFacilityGeometryResponse@787988f4}]
- 17:12:02.750 [main] DEBUG org.springframework.test.web.servlet.TestDispatcherServlet - Completed 200 OK
- 17:12:02.751 [main] DEBUG com.jayway.jsonpath.internal.path.CompiledPath - Evaluating path: $['data']['features']
- 17:12:02.751 [main] DEBUG com.jayway.jsonpath.internal.path.CompiledPath - Evaluating path: $['data']['features'][0]['geometry']['type']
- 17:12:02.751 [main] DEBUG com.jayway.jsonpath.internal.path.CompiledPath - Evaluating path: $['data']['features'][0]['properties']['diameter']
- 17:12:02.751 [main] DEBUG com.jayway.jsonpath.internal.path.CompiledPath - Evaluating path: $['data']['features'][1]['properties']['diameter']
- 17:12:02.751 [main] DEBUG com.jayway.jsonpath.internal.path.CompiledPath - Evaluating path: $['data']['features'][0]['geometry']['coordinates']
- 17:12:02.752 [main] DEBUG com.jayway.jsonpath.internal.path.CompiledPath - Evaluating path: $['data']['features'][0]['geometry']['coordinates'][0][0]
- 17:12:02.752 [main] DEBUG com.jayway.jsonpath.internal.path.CompiledPath - Evaluating path: $['data']['features'][0]['geometry']['coordinates'][0][1]
- 17:12:02.752 [main] DEBUG com.jayway.jsonpath.internal.path.CompiledPath - Evaluating path: $['data']['features'][0]['geometry']['coordinates'][1][0]
- 17:12:02.753 [main] DEBUG com.jayway.jsonpath.internal.path.CompiledPath - Evaluating path: $['data']['features'][0]['geometry']['coordinates'][1][1]
- 17:12:02.754 [main] DEBUG com.jayway.jsonpath.internal.path.CompiledPath - Evaluating path: $['data']['features'][1]['geometry']['type']
- 17:12:02.755 [main] DEBUG com.jayway.jsonpath.internal.path.CompiledPath - Evaluating path: $['data']['features'][1]['geometry']['coordinates']
- 17:12:02.756 [main] DEBUG com.jayway.jsonpath.internal.path.CompiledPath - Evaluating path: $['data']['features'][1]['geometry']['coordinates'][0]
- 17:12:02.756 [main] DEBUG com.jayway.jsonpath.internal.path.CompiledPath - Evaluating path: $['data']['features'][1]['geometry']['coordinates'][1]
- 17:12:02.756 [main] DEBUG com.jayway.jsonpath.internal.path.CompiledPath - Evaluating path: $['data']['features'][1]['properties']['pointType']
- 17:12:02.757 [main] DEBUG com.jayway.jsonpath.internal.path.CompiledPath - Evaluating path: $['data']['features'][1]['properties']['networkId']
- 17:12:02.758 [main] DEBUG com.jayway.jsonpath.internal.path.CompiledPath - Evaluating path: $['data']['features'][1]['properties']['coordinateValidation']['state']
- 17:12:02.758 [main] DEBUG com.jayway.jsonpath.internal.path.CompiledPath - Evaluating path: $['data']['features'][1]['properties']['coordinateValidation']['renderable']
- 17:12:02.760 [main] DEBUG org.hibernate.validator.messageinterpolation.ResourceBundleMessageInterpolator - Loaded expression factory via original TCCL
- 17:12:02.760 [main] DEBUG org.hibernate.validator.internal.engine.AbstractConfigurationImpl - Setting custom MessageInterpolator of type org.springframework.validation.beanvalidation.LocaleContextMessageInterpolator
- 17:12:02.760 [main] DEBUG org.hibernate.validator.internal.engine.AbstractConfigurationImpl - Setting custom ParameterNameProvider of type org.springframework.validation.beanvalidation.LocalValidatorFactoryBean$1
- 17:12:02.760 [main] DEBUG org.hibernate.validator.internal.xml.config.ValidationXmlParser - Trying to load META-INF/validation.xml for XML based Validator configuration.
- 17:12:02.760 [main] DEBUG org.hibernate.validator.internal.xml.config.ResourceLoaderHelper - Trying to load META-INF/validation.xml via TCCL
- 17:12:02.760 [main] DEBUG org.hibernate.validator.internal.xml.config.ResourceLoaderHelper - Trying to load META-INF/validation.xml via Hibernate Validator's class loader
- 17:12:02.760 [main] DEBUG org.hibernate.validator.internal.xml.config.ValidationXmlParser - No META-INF/validation.xml found. Using annotation based configuration only.
- 17:12:02.761 [main] DEBUG org.hibernate.validator.internal.engine.resolver.TraversableResolvers - Cannot find javax.persistence.Persistence on classpath. Assuming non JPA 2 environment. All properties will per default be traversable.
- 17:12:02.762 [main] DEBUG org.hibernate.validator.internal.engine.ValidatorFactoryConfigurationHelper - HV000252: Using org.hibernate.validator.internal.engine.DefaultPropertyNodeNameProvider as property node name provider.
- 17:12:02.762 [main] DEBUG org.hibernate.validator.internal.engine.ValidatorFactoryConfigurationHelper - HV000234: Using org.springframework.validation.beanvalidation.LocaleContextMessageInterpolator as ValidatorFactory-scoped message interpolator.
- 17:12:02.762 [main] DEBUG org.hibernate.validator.internal.engine.ValidatorFactoryConfigurationHelper - HV000234: Using org.hibernate.validator.internal.engine.resolver.TraverseAllTraversableResolver as ValidatorFactory-scoped traversable resolver.
- 17:12:02.762 [main] DEBUG org.hibernate.validator.internal.engine.ValidatorFactoryConfigurationHelper - HV000234: Using org.hibernate.validator.internal.util.ExecutableParameterNameProvider as ValidatorFactory-scoped parameter name provider.
- 17:12:02.762 [main] DEBUG org.hibernate.validator.internal.engine.ValidatorFactoryConfigurationHelper - HV000234: Using org.hibernate.validator.internal.engine.DefaultClockProvider as ValidatorFactory-scoped clock provider.
- 17:12:02.762 [main] DEBUG org.hibernate.validator.internal.engine.ValidatorFactoryConfigurationHelper - HV000234: Using org.hibernate.validator.internal.engine.scripting.DefaultScriptEvaluatorFactory as ValidatorFactory-scoped script evaluator factory.
- 17:12:02.763 [main] DEBUG _org.springframework.web.servlet.HandlerMapping.Mappings -
- c.z.w.c.c.CockpitFacilityGeometryController:
- {GET [/api/cockpit/v1/infrastructure/geometry]}: geometry()
- 17:12:02.763 [main] DEBUG org.springframework.web.servlet.mvc.method.annotation.RequestMappingHandlerMapping - 1 mappings in org.springframework.web.servlet.mvc.method.annotation.RequestMappingHandlerMapping
- 17:12:02.768 [main] DEBUG org.springframework.web.servlet.mvc.method.annotation.RequestMappingHandlerAdapter - ControllerAdvice beans: 0 @ModelAttribute, 0 @InitBinder, 1 RequestBodyAdvice, 1 ResponseBodyAdvice
- 17:12:02.769 [main] DEBUG org.springframework.web.servlet.mvc.method.annotation.ExceptionHandlerExceptionResolver - ControllerAdvice beans: 0 @ExceptionHandler, 1 ResponseBodyAdvice
- 17:12:02.769 [main] INFO org.springframework.mock.web.MockServletContext - Initializing Spring TestDispatcherServlet ''
- 17:12:02.769 [main] INFO org.springframework.test.web.servlet.TestDispatcherServlet - Initializing Servlet ''
- 17:12:02.769 [main] DEBUG org.springframework.test.web.servlet.TestDispatcherServlet - Detected AcceptHeaderLocaleResolver
- 17:12:02.769 [main] DEBUG org.springframework.test.web.servlet.TestDispatcherServlet - Detected FixedThemeResolver
- 17:12:02.769 [main] DEBUG org.springframework.test.web.servlet.TestDispatcherServlet - Detected org.springframework.web.servlet.view.DefaultRequestToViewNameTranslator@27ec8754
- 17:12:02.769 [main] DEBUG org.springframework.test.web.servlet.TestDispatcherServlet - Detected org.springframework.web.servlet.support.SessionFlashMapManager@3bbf1c0d
- 17:12:02.769 [main] DEBUG org.springframework.test.web.servlet.TestDispatcherServlet - enableLoggingRequestDetails='false': request parameters and headers will be masked to prevent unsafe logging of potentially sensitive data
- 17:12:02.769 [main] INFO org.springframework.test.web.servlet.TestDispatcherServlet - Completed initialization in 0 ms
- 17:12:02.773 [main] DEBUG org.springframework.test.web.servlet.TestDispatcherServlet - GET "/api/cockpit/v1/infrastructure/geometry", parameters={}
- 17:12:02.773 [main] DEBUG org.springframework.web.servlet.mvc.method.annotation.RequestMappingHandlerMapping - Mapped to com.zksy.web.controller.cockpit.CockpitFacilityGeometryController#geometry()
- 17:12:02.774 [main] DEBUG org.springframework.web.servlet.mvc.method.annotation.ExceptionHandlerExceptionResolver - Using @ExceptionHandler com.zksy.web.controller.cockpit.CockpitFacilityGeometryController#handleReadFailure(HttpServletRequest, RuntimeException)
- 17:12:02.776 [main] ERROR com.zksy.web.controller.cockpit.CockpitFacilityGeometryController - Facility geometry read failed
- org.springframework.transaction.CannotCreateTransactionException: private connection detail
- at com.zksy.web.controller.cockpit.CockpitFacilityGeometryController.geometry(CockpitFacilityGeometryController.java:31)
- at java.base/jdk.internal.reflect.NativeMethodAccessorImpl.invoke0(Native Method)
- at java.base/jdk.internal.reflect.NativeMethodAccessorImpl.invoke(NativeMethodAccessorImpl.java:77)
- at java.base/jdk.internal.reflect.DelegatingMethodAccessorImpl.invoke(DelegatingMethodAccessorImpl.java:43)
- at java.base/java.lang.reflect.Method.invoke(Method.java:568)
- at org.springframework.web.method.support.InvocableHandlerMethod.doInvoke(InvocableHandlerMethod.java:205)
- at org.springframework.web.method.support.InvocableHandlerMethod.invokeForRequest(InvocableHandlerMethod.java:150)
- at org.springframework.web.servlet.mvc.method.annotation.ServletInvocableHandlerMethod.invokeAndHandle(ServletInvocableHandlerMethod.java:117)
- at org.springframework.web.servlet.mvc.method.annotation.RequestMappingHandlerAdapter.invokeHandlerMethod(RequestMappingHandlerAdapter.java:903)
- at org.springframework.web.servlet.mvc.method.annotation.RequestMappingHandlerAdapter.handleInternal(RequestMappingHandlerAdapter.java:809)
- at org.springframework.web.servlet.mvc.method.AbstractHandlerMethodAdapter.handle(AbstractHandlerMethodAdapter.java:87)
- at org.springframework.web.servlet.DispatcherServlet.doDispatch(DispatcherServlet.java:1072)
- at org.springframework.web.servlet.DispatcherServlet.doService(DispatcherServlet.java:965)
- at org.springframework.web.servlet.FrameworkServlet.processRequest(FrameworkServlet.java:1006)
- at org.springframework.web.servlet.FrameworkServlet.doGet(FrameworkServlet.java:898)
- at javax.servlet.http.HttpServlet.service(HttpServlet.java:529)
- at org.springframework.web.servlet.FrameworkServlet.service(FrameworkServlet.java:883)
- at org.springframework.test.web.servlet.TestDispatcherServlet.service(TestDispatcherServlet.java:72)
- at javax.servlet.http.HttpServlet.service(HttpServlet.java:623)
- at org.springframework.mock.web.MockFilterChain$ServletFilterProxy.doFilter(MockFilterChain.java:167)
- at org.springframework.mock.web.MockFilterChain.doFilter(MockFilterChain.java:134)
- at org.springframework.test.web.servlet.MockMvc.perform(MockMvc.java:201)
- at com.zksy.web.controller.cockpit.CockpitFacilityGeometryControllerTest.transactionProxyFailureIsAlsoMappedToSanitized500(CockpitFacilityGeometryControllerTest.java:148)
- at java.base/jdk.internal.reflect.NativeMethodAccessorImpl.invoke0(Native Method)
- at java.base/jdk.internal.reflect.NativeMethodAccessorImpl.invoke(NativeMethodAccessorImpl.java:77)
- at java.base/jdk.internal.reflect.DelegatingMethodAccessorImpl.invoke(DelegatingMethodAccessorImpl.java:43)
- at java.base/java.lang.reflect.Method.invoke(Method.java:568)
- at org.junit.platform.commons.util.ReflectionUtils.invokeMethod(ReflectionUtils.java:688)
- at org.junit.jupiter.engine.execution.MethodInvocation.proceed(MethodInvocation.java:60)
- at org.junit.jupiter.engine.execution.InvocationInterceptorChain$ValidatingInvocation.proceed(InvocationInterceptorChain.java:131)
- at org.junit.jupiter.engine.extension.TimeoutExtension.intercept(TimeoutExtension.java:149)
- at org.junit.jupiter.engine.extension.TimeoutExtension.interceptTestableMethod(TimeoutExtension.java:140)
- at org.junit.jupiter.engine.extension.TimeoutExtension.interceptTestMethod(TimeoutExtension.java:84)
- at org.junit.jupiter.engine.execution.ExecutableInvoker$ReflectiveInterceptorCall.lambda$ofVoidMethod$0(ExecutableInvoker.java:115)
- at org.junit.jupiter.engine.execution.ExecutableInvoker.lambda$invoke$0(ExecutableInvoker.java:105)
- at org.junit.jupiter.engine.execution.InvocationInterceptorChain$InterceptedInvocation.proceed(InvocationInterceptorChain.java:106)
- at org.junit.jupiter.engine.execution.InvocationInterceptorChain.proceed(InvocationInterceptorChain.java:64)
- at org.junit.jupiter.engine.execution.InvocationInterceptorChain.chainAndInvoke(InvocationInterceptorChain.java:45)
- at org.junit.jupiter.engine.execution.InvocationInterceptorChain.invoke(InvocationInterceptorChain.java:37)
- at org.junit.jupiter.engine.execution.ExecutableInvoker.invoke(ExecutableInvoker.java:104)
- at org.junit.jupiter.engine.execution.ExecutableInvoker.invoke(ExecutableInvoker.java:98)
- at org.junit.jupiter.engine.descriptor.TestMethodTestDescriptor.lambda$invokeTestMethod$6(TestMethodTestDescriptor.java:210)
- at org.junit.platform.engine.support.hierarchical.ThrowableCollector.execute(ThrowableCollector.java:73)
- at org.junit.jupiter.engine.descriptor.TestMethodTestDescriptor.invokeTestMethod(TestMethodTestDescriptor.java:206)
- at org.junit.jupiter.engine.descriptor.TestMethodTestDescriptor.execute(TestMethodTestDescriptor.java:131)
- at org.junit.jupiter.engine.descriptor.TestMethodTestDescriptor.execute(TestMethodTestDescriptor.java:65)
- at org.junit.platform.engine.support.hierarchical.NodeTestTask.lambda$executeRecursively$5(NodeTestTask.java:139)
- at org.junit.platform.engine.support.hierarchical.ThrowableCollector.execute(ThrowableCollector.java:73)
- at org.junit.platform.engine.support.hierarchical.NodeTestTask.lambda$executeRecursively$7(NodeTestTask.java:129)
- at org.junit.platform.engine.support.hierarchical.Node.around(Node.java:137)
- at org.junit.platform.engine.support.hierarchical.NodeTestTask.lambda$executeRecursively$8(NodeTestTask.java:127)
- at org.junit.platform.engine.support.hierarchical.ThrowableCollector.execute(ThrowableCollector.java:73)
- at org.junit.platform.engine.support.hierarchical.NodeTestTask.executeRecursively(NodeTestTask.java:126)
- at org.junit.platform.engine.support.hierarchical.NodeTestTask.execute(NodeTestTask.java:84)
- at java.base/java.util.ArrayList.forEach(ArrayList.java:1511)
- at org.junit.platform.engine.support.hierarchical.SameThreadHierarchicalTestExecutorService.invokeAll(SameThreadHierarchicalTestExecutorService.java:38)
- at org.junit.platform.engine.support.hierarchical.NodeTestTask.lambda$executeRecursively$5(NodeTestTask.java:143)
- at org.junit.platform.engine.support.hierarchical.ThrowableCollector.execute(ThrowableCollector.java:73)
- at org.junit.platform.engine.support.hierarchical.NodeTestTask.lambda$executeRecursively$7(NodeTestTask.java:129)
- at org.junit.platform.engine.support.hierarchical.Node.around(Node.java:137)
- at org.junit.platform.engine.support.hierarchical.NodeTestTask.lambda$executeRecursively$8(NodeTestTask.java:127)
- at org.junit.platform.engine.support.hierarchical.ThrowableCollector.execute(ThrowableCollector.java:73)
- at org.junit.platform.engine.support.hierarchical.NodeTestTask.executeRecursively(NodeTestTask.java:126)
- at org.junit.platform.engine.support.hierarchical.NodeTestTask.execute(NodeTestTask.java:84)
- at java.base/java.util.ArrayList.forEach(ArrayList.java:1511)
- at org.junit.platform.engine.support.hierarchical.SameThreadHierarchicalTestExecutorService.invokeAll(SameThreadHierarchicalTestExecutorService.java:38)
- at org.junit.platform.engine.support.hierarchical.NodeTestTask.lambda$executeRecursively$5(NodeTestTask.java:143)
- at org.junit.platform.engine.support.hierarchical.ThrowableCollector.execute(ThrowableCollector.java:73)
- at org.junit.platform.engine.support.hierarchical.NodeTestTask.lambda$executeRecursively$7(NodeTestTask.java:129)
- at org.junit.platform.engine.support.hierarchical.Node.around(Node.java:137)
- at org.junit.platform.engine.support.hierarchical.NodeTestTask.lambda$executeRecursively$8(NodeTestTask.java:127)
- at org.junit.platform.engine.support.hierarchical.ThrowableCollector.execute(ThrowableCollector.java:73)
- at org.junit.platform.engine.support.hierarchical.NodeTestTask.executeRecursively(NodeTestTask.java:126)
- at org.junit.platform.engine.support.hierarchical.NodeTestTask.execute(NodeTestTask.java:84)
- at org.junit.platform.engine.support.hierarchical.SameThreadHierarchicalTestExecutorService.submit(SameThreadHierarchicalTestExecutorService.java:32)
- at org.junit.platform.engine.support.hierarchical.HierarchicalTestExecutor.execute(HierarchicalTestExecutor.java:57)
- at org.junit.platform.engine.support.hierarchical.HierarchicalTestEngine.execute(HierarchicalTestEngine.java:51)
- at org.junit.platform.launcher.core.DefaultLauncher.execute(DefaultLauncher.java:220)
- at org.junit.platform.launcher.core.DefaultLauncher.lambda$execute$6(DefaultLauncher.java:188)
- at org.junit.platform.launcher.core.DefaultLauncher.withInterceptedStreams(DefaultLauncher.java:202)
- at org.junit.platform.launcher.core.DefaultLauncher.execute(DefaultLauncher.java:181)
- at org.junit.platform.launcher.core.DefaultLauncher.execute(DefaultLauncher.java:128)
- at org.apache.maven.surefire.junitplatform.JUnitPlatformProvider.invokeAllTests(JUnitPlatformProvider.java:150)
- at org.apache.maven.surefire.junitplatform.JUnitPlatformProvider.invoke(JUnitPlatformProvider.java:124)
- at org.apache.maven.surefire.booter.ForkedBooter.invokeProviderInSameClassLoader(ForkedBooter.java:384)
- at org.apache.maven.surefire.booter.ForkedBooter.runSuitesInProcess(ForkedBooter.java:345)
- at org.apache.maven.surefire.booter.ForkedBooter.execute(ForkedBooter.java:126)
- at org.apache.maven.surefire.booter.ForkedBooter.main(ForkedBooter.java:418)
- 17:12:02.777 [main] DEBUG org.springframework.web.servlet.mvc.method.annotation.HttpEntityMethodProcessor - Using 'application/json', given [*/*] and supported [application/json, application/*+json]
- 17:12:02.778 [main] DEBUG org.springframework.web.servlet.mvc.method.annotation.HttpEntityMethodProcessor - Writing [{msg=facility geometry source unavailable, code=500, data=com.zksy.cockpit.foundation.CockpitErrorPa (truncated)...]
- 17:12:02.779 [main] DEBUG org.springframework.web.servlet.mvc.method.annotation.ExceptionHandlerExceptionResolver - Resolved [org.springframework.transaction.CannotCreateTransactionException: private connection detail]
- 17:12:02.779 [main] DEBUG org.springframework.test.web.servlet.TestDispatcherServlet - Completed 500 INTERNAL_SERVER_ERROR
- 17:12:02.779 [main] DEBUG com.jayway.jsonpath.internal.path.CompiledPath - Evaluating path: $['code']
- 17:12:02.779 [main] DEBUG com.jayway.jsonpath.internal.path.CompiledPath - Evaluating path: $['data']['category']
- 17:12:02.779 [main] DEBUG com.jayway.jsonpath.internal.path.CompiledPath - Evaluating path: $['data']['message']
- 17:12:02.779 [main] DEBUG com.jayway.jsonpath.internal.path.CompiledPath - Evaluating path: $['data']['requestId']
- 17:12:02.780 [main] DEBUG org.hibernate.validator.messageinterpolation.ResourceBundleMessageInterpolator - Loaded expression factory via original TCCL
- 17:12:02.780 [main] DEBUG org.hibernate.validator.internal.engine.AbstractConfigurationImpl - Setting custom MessageInterpolator of type org.springframework.validation.beanvalidation.LocaleContextMessageInterpolator
- 17:12:02.780 [main] DEBUG org.hibernate.validator.internal.engine.AbstractConfigurationImpl - Setting custom ParameterNameProvider of type org.springframework.validation.beanvalidation.LocalValidatorFactoryBean$1
- 17:12:02.780 [main] DEBUG org.hibernate.validator.internal.xml.config.ValidationXmlParser - Trying to load META-INF/validation.xml for XML based Validator configuration.
- 17:12:02.780 [main] DEBUG org.hibernate.validator.internal.xml.config.ResourceLoaderHelper - Trying to load META-INF/validation.xml via TCCL
- 17:12:02.781 [main] DEBUG org.hibernate.validator.internal.xml.config.ResourceLoaderHelper - Trying to load META-INF/validation.xml via Hibernate Validator's class loader
- 17:12:02.781 [main] DEBUG org.hibernate.validator.internal.xml.config.ValidationXmlParser - No META-INF/validation.xml found. Using annotation based configuration only.
- 17:12:02.781 [main] DEBUG org.hibernate.validator.internal.engine.resolver.TraversableResolvers - Cannot find javax.persistence.Persistence on classpath. Assuming non JPA 2 environment. All properties will per default be traversable.
- 17:12:02.782 [main] DEBUG org.hibernate.validator.internal.engine.ValidatorFactoryConfigurationHelper - HV000252: Using org.hibernate.validator.internal.engine.DefaultPropertyNodeNameProvider as property node name provider.
- 17:12:02.782 [main] DEBUG org.hibernate.validator.internal.engine.ValidatorFactoryConfigurationHelper - HV000234: Using org.springframework.validation.beanvalidation.LocaleContextMessageInterpolator as ValidatorFactory-scoped message interpolator.
- 17:12:02.782 [main] DEBUG org.hibernate.validator.internal.engine.ValidatorFactoryConfigurationHelper - HV000234: Using org.hibernate.validator.internal.engine.resolver.TraverseAllTraversableResolver as ValidatorFactory-scoped traversable resolver.
- 17:12:02.782 [main] DEBUG org.hibernate.validator.internal.engine.ValidatorFactoryConfigurationHelper - HV000234: Using org.hibernate.validator.internal.util.ExecutableParameterNameProvider as ValidatorFactory-scoped parameter name provider.
- 17:12:02.782 [main] DEBUG org.hibernate.validator.internal.engine.ValidatorFactoryConfigurationHelper - HV000234: Using org.hibernate.validator.internal.engine.DefaultClockProvider as ValidatorFactory-scoped clock provider.
- 17:12:02.782 [main] DEBUG org.hibernate.validator.internal.engine.ValidatorFactoryConfigurationHelper - HV000234: Using org.hibernate.validator.internal.engine.scripting.DefaultScriptEvaluatorFactory as ValidatorFactory-scoped script evaluator factory.
- 17:12:02.783 [main] DEBUG _org.springframework.web.servlet.HandlerMapping.Mappings -
- c.z.w.c.c.CockpitFacilityGeometryController:
- {GET [/api/cockpit/v1/infrastructure/geometry]}: geometry()
- 17:12:02.784 [main] DEBUG org.springframework.web.servlet.mvc.method.annotation.RequestMappingHandlerMapping - 1 mappings in org.springframework.web.servlet.mvc.method.annotation.RequestMappingHandlerMapping
- 17:12:02.789 [main] DEBUG org.springframework.web.servlet.mvc.method.annotation.RequestMappingHandlerAdapter - ControllerAdvice beans: 0 @ModelAttribute, 0 @InitBinder, 1 RequestBodyAdvice, 1 ResponseBodyAdvice
- 17:12:02.791 [main] DEBUG org.springframework.web.servlet.mvc.method.annotation.ExceptionHandlerExceptionResolver - ControllerAdvice beans: 0 @ExceptionHandler, 1 ResponseBodyAdvice
- 17:12:02.792 [main] INFO org.springframework.mock.web.MockServletContext - Initializing Spring TestDispatcherServlet ''
- 17:12:02.792 [main] INFO org.springframework.test.web.servlet.TestDispatcherServlet - Initializing Servlet ''
- 17:12:02.792 [main] DEBUG org.springframework.test.web.servlet.TestDispatcherServlet - Detected AcceptHeaderLocaleResolver
- 17:12:02.792 [main] DEBUG org.springframework.test.web.servlet.TestDispatcherServlet - Detected FixedThemeResolver
- 17:12:02.792 [main] DEBUG org.springframework.test.web.servlet.TestDispatcherServlet - Detected org.springframework.web.servlet.view.DefaultRequestToViewNameTranslator@120aa40b
- 17:12:02.792 [main] DEBUG org.springframework.test.web.servlet.TestDispatcherServlet - Detected org.springframework.web.servlet.support.SessionFlashMapManager@32ab408e
- 17:12:02.792 [main] DEBUG org.springframework.test.web.servlet.TestDispatcherServlet - enableLoggingRequestDetails='false': request parameters and headers will be masked to prevent unsafe logging of potentially sensitive data
- 17:12:02.792 [main] INFO org.springframework.test.web.servlet.TestDispatcherServlet - Completed initialization in 0 ms
- 17:12:02.792 [main] DEBUG org.springframework.test.web.servlet.TestDispatcherServlet - GET "/api/cockpit/v1/infrastructure/geometry", parameters={}
- 17:12:02.793 [main] DEBUG org.springframework.web.servlet.mvc.method.annotation.RequestMappingHandlerMapping - Mapped to com.zksy.web.controller.cockpit.CockpitFacilityGeometryController#geometry()
- 17:12:02.793 [main] DEBUG org.springframework.web.servlet.mvc.method.annotation.ExceptionHandlerExceptionResolver - Using @ExceptionHandler com.zksy.web.controller.cockpit.CockpitFacilityGeometryController#handleReadFailure(HttpServletRequest, RuntimeException)
- 17:12:02.793 [main] ERROR com.zksy.web.controller.cockpit.CockpitFacilityGeometryController - Facility geometry read failed
- com.zksy.cockpit.foundation.CockpitReadException: private database details
- at com.zksy.web.controller.cockpit.CockpitFacilityGeometryController.geometry(CockpitFacilityGeometryController.java:31)
- at java.base/jdk.internal.reflect.NativeMethodAccessorImpl.invoke0(Native Method)
- at java.base/jdk.internal.reflect.NativeMethodAccessorImpl.invoke(NativeMethodAccessorImpl.java:77)
- at java.base/jdk.internal.reflect.DelegatingMethodAccessorImpl.invoke(DelegatingMethodAccessorImpl.java:43)
- at java.base/java.lang.reflect.Method.invoke(Method.java:568)
- at org.springframework.web.method.support.InvocableHandlerMethod.doInvoke(InvocableHandlerMethod.java:205)
- at org.springframework.web.method.support.InvocableHandlerMethod.invokeForRequest(InvocableHandlerMethod.java:150)
- at org.springframework.web.servlet.mvc.method.annotation.ServletInvocableHandlerMethod.invokeAndHandle(ServletInvocableHandlerMethod.java:117)
- at org.springframework.web.servlet.mvc.method.annotation.RequestMappingHandlerAdapter.invokeHandlerMethod(RequestMappingHandlerAdapter.java:903)
- at org.springframework.web.servlet.mvc.method.annotation.RequestMappingHandlerAdapter.handleInternal(RequestMappingHandlerAdapter.java:809)
- at org.springframework.web.servlet.mvc.method.AbstractHandlerMethodAdapter.handle(AbstractHandlerMethodAdapter.java:87)
- at org.springframework.web.servlet.DispatcherServlet.doDispatch(DispatcherServlet.java:1072)
- at org.springframework.web.servlet.DispatcherServlet.doService(DispatcherServlet.java:965)
- at org.springframework.web.servlet.FrameworkServlet.processRequest(FrameworkServlet.java:1006)
- at org.springframework.web.servlet.FrameworkServlet.doGet(FrameworkServlet.java:898)
- at javax.servlet.http.HttpServlet.service(HttpServlet.java:529)
- at org.springframework.web.servlet.FrameworkServlet.service(FrameworkServlet.java:883)
- at org.springframework.test.web.servlet.TestDispatcherServlet.service(TestDispatcherServlet.java:72)
- at javax.servlet.http.HttpServlet.service(HttpServlet.java:623)
- at org.springframework.mock.web.MockFilterChain$ServletFilterProxy.doFilter(MockFilterChain.java:167)
- at org.springframework.mock.web.MockFilterChain.doFilter(MockFilterChain.java:134)
- at org.springframework.test.web.servlet.MockMvc.perform(MockMvc.java:201)
- at com.zksy.web.controller.cockpit.CockpitFacilityGeometryControllerTest.sourceFailureReturns500AndStableCategoryRatherThanSuccess(CockpitFacilityGeometryControllerTest.java:88)
- at java.base/jdk.internal.reflect.NativeMethodAccessorImpl.invoke0(Native Method)
- at java.base/jdk.internal.reflect.NativeMethodAccessorImpl.invoke(NativeMethodAccessorImpl.java:77)
- at java.base/jdk.internal.reflect.DelegatingMethodAccessorImpl.invoke(DelegatingMethodAccessorImpl.java:43)
- at java.base/java.lang.reflect.Method.invoke(Method.java:568)
- at org.junit.platform.commons.util.ReflectionUtils.invokeMethod(ReflectionUtils.java:688)
- at org.junit.jupiter.engine.execution.MethodInvocation.proceed(MethodInvocation.java:60)
- at org.junit.jupiter.engine.execution.InvocationInterceptorChain$ValidatingInvocation.proceed(InvocationInterceptorChain.java:131)
- at org.junit.jupiter.engine.extension.TimeoutExtension.intercept(TimeoutExtension.java:149)
- at org.junit.jupiter.engine.extension.TimeoutExtension.interceptTestableMethod(TimeoutExtension.java:140)
- at org.junit.jupiter.engine.extension.TimeoutExtension.interceptTestMethod(TimeoutExtension.java:84)
- at org.junit.jupiter.engine.execution.ExecutableInvoker$ReflectiveInterceptorCall.lambda$ofVoidMethod$0(ExecutableInvoker.java:115)
- at org.junit.jupiter.engine.execution.ExecutableInvoker.lambda$invoke$0(ExecutableInvoker.java:105)
- at org.junit.jupiter.engine.execution.InvocationInterceptorChain$InterceptedInvocation.proceed(InvocationInterceptorChain.java:106)
- at org.junit.jupiter.engine.execution.InvocationInterceptorChain.proceed(InvocationInterceptorChain.java:64)
- at org.junit.jupiter.engine.execution.InvocationInterceptorChain.chainAndInvoke(InvocationInterceptorChain.java:45)
- at org.junit.jupiter.engine.execution.InvocationInterceptorChain.invoke(InvocationInterceptorChain.java:37)
- at org.junit.jupiter.engine.execution.ExecutableInvoker.invoke(ExecutableInvoker.java:104)
- at org.junit.jupiter.engine.execution.ExecutableInvoker.invoke(ExecutableInvoker.java:98)
- at org.junit.jupiter.engine.descriptor.TestMethodTestDescriptor.lambda$invokeTestMethod$6(TestMethodTestDescriptor.java:210)
- at org.junit.platform.engine.support.hierarchical.ThrowableCollector.execute(ThrowableCollector.java:73)
- at org.junit.jupiter.engine.descriptor.TestMethodTestDescriptor.invokeTestMethod(TestMethodTestDescriptor.java:206)
- at org.junit.jupiter.engine.descriptor.TestMethodTestDescriptor.execute(TestMethodTestDescriptor.java:131)
- at org.junit.jupiter.engine.descriptor.TestMethodTestDescriptor.execute(TestMethodTestDescriptor.java:65)
- at org.junit.platform.engine.support.hierarchical.NodeTestTask.lambda$executeRecursively$5(NodeTestTask.java:139)
- at org.junit.platform.engine.support.hierarchical.ThrowableCollector.execute(ThrowableCollector.java:73)
- at org.junit.platform.engine.support.hierarchical.NodeTestTask.lambda$executeRecursively$7(NodeTestTask.java:129)
- at org.junit.platform.engine.support.hierarchical.Node.around(Node.java:137)
- at org.junit.platform.engine.support.hierarchical.NodeTestTask.lambda$executeRecursively$8(NodeTestTask.java:127)
- at org.junit.platform.engine.support.hierarchical.ThrowableCollector.execute(ThrowableCollector.java:73)
- at org.junit.platform.engine.support.hierarchical.NodeTestTask.executeRecursively(NodeTestTask.java:126)
- at org.junit.platform.engine.support.hierarchical.NodeTestTask.execute(NodeTestTask.java:84)
- at java.base/java.util.ArrayList.forEach(ArrayList.java:1511)
- at org.junit.platform.engine.support.hierarchical.SameThreadHierarchicalTestExecutorService.invokeAll(SameThreadHierarchicalTestExecutorService.java:38)
- at org.junit.platform.engine.support.hierarchical.NodeTestTask.lambda$executeRecursively$5(NodeTestTask.java:143)
- at org.junit.platform.engine.support.hierarchical.ThrowableCollector.execute(ThrowableCollector.java:73)
- at org.junit.platform.engine.support.hierarchical.NodeTestTask.lambda$executeRecursively$7(NodeTestTask.java:129)
- at org.junit.platform.engine.support.hierarchical.Node.around(Node.java:137)
- at org.junit.platform.engine.support.hierarchical.NodeTestTask.lambda$executeRecursively$8(NodeTestTask.java:127)
- at org.junit.platform.engine.support.hierarchical.ThrowableCollector.execute(ThrowableCollector.java:73)
- at org.junit.platform.engine.support.hierarchical.NodeTestTask.executeRecursively(NodeTestTask.java:126)
- at org.junit.platform.engine.support.hierarchical.NodeTestTask.execute(NodeTestTask.java:84)
- at java.base/java.util.ArrayList.forEach(ArrayList.java:1511)
- at org.junit.platform.engine.support.hierarchical.SameThreadHierarchicalTestExecutorService.invokeAll(SameThreadHierarchicalTestExecutorService.java:38)
- at org.junit.platform.engine.support.hierarchical.NodeTestTask.lambda$executeRecursively$5(NodeTestTask.java:143)
- at org.junit.platform.engine.support.hierarchical.ThrowableCollector.execute(ThrowableCollector.java:73)
- at org.junit.platform.engine.support.hierarchical.NodeTestTask.lambda$executeRecursively$7(NodeTestTask.java:129)
- at org.junit.platform.engine.support.hierarchical.Node.around(Node.java:137)
- at org.junit.platform.engine.support.hierarchical.NodeTestTask.lambda$executeRecursively$8(NodeTestTask.java:127)
- at org.junit.platform.engine.support.hierarchical.ThrowableCollector.execute(ThrowableCollector.java:73)
- at org.junit.platform.engine.support.hierarchical.NodeTestTask.executeRecursively(NodeTestTask.java:126)
- at org.junit.platform.engine.support.hierarchical.NodeTestTask.execute(NodeTestTask.java:84)
- at org.junit.platform.engine.support.hierarchical.SameThreadHierarchicalTestExecutorService.submit(SameThreadHierarchicalTestExecutorService.java:32)
- at org.junit.platform.engine.support.hierarchical.HierarchicalTestExecutor.execute(HierarchicalTestExecutor.java:57)
- at org.junit.platform.engine.support.hierarchical.HierarchicalTestEngine.execute(HierarchicalTestEngine.java:51)
- at org.junit.platform.launcher.core.DefaultLauncher.execute(DefaultLauncher.java:220)
- at org.junit.platform.launcher.core.DefaultLauncher.lambda$execute$6(DefaultLauncher.java:188)
- at org.junit.platform.launcher.core.DefaultLauncher.withInterceptedStreams(DefaultLauncher.java:202)
- at org.junit.platform.launcher.core.DefaultLauncher.execute(DefaultLauncher.java:181)
- at org.junit.platform.launcher.core.DefaultLauncher.execute(DefaultLauncher.java:128)
- at org.apache.maven.surefire.junitplatform.JUnitPlatformProvider.invokeAllTests(JUnitPlatformProvider.java:150)
- at org.apache.maven.surefire.junitplatform.JUnitPlatformProvider.invoke(JUnitPlatformProvider.java:124)
- at org.apache.maven.surefire.booter.ForkedBooter.invokeProviderInSameClassLoader(ForkedBooter.java:384)
- at org.apache.maven.surefire.booter.ForkedBooter.runSuitesInProcess(ForkedBooter.java:345)
- at org.apache.maven.surefire.booter.ForkedBooter.execute(ForkedBooter.java:126)
- at org.apache.maven.surefire.booter.ForkedBooter.main(ForkedBooter.java:418)
- 17:12:02.794 [main] DEBUG org.springframework.web.servlet.mvc.method.annotation.HttpEntityMethodProcessor - Using 'application/json', given [*/*] and supported [application/json, application/*+json]
- 17:12:02.794 [main] DEBUG org.springframework.web.servlet.mvc.method.annotation.HttpEntityMethodProcessor - Writing [{msg=facility geometry source unavailable, code=500, data=com.zksy.cockpit.foundation.CockpitErrorPa (truncated)...]
- 17:12:02.794 [main] DEBUG org.springframework.web.servlet.mvc.method.annotation.ExceptionHandlerExceptionResolver - Resolved [com.zksy.cockpit.foundation.CockpitReadException: private database details]
- 17:12:02.794 [main] DEBUG org.springframework.test.web.servlet.TestDispatcherServlet - Completed 500 INTERNAL_SERVER_ERROR
- 17:12:02.794 [main] DEBUG com.jayway.jsonpath.internal.path.CompiledPath - Evaluating path: $['code']
- 17:12:02.794 [main] DEBUG com.jayway.jsonpath.internal.path.CompiledPath - Evaluating path: $['data']['category']
- 17:12:02.795 [main] DEBUG com.jayway.jsonpath.internal.path.CompiledPath - Evaluating path: $['data']['message']
- 17:12:02.795 [main] DEBUG com.jayway.jsonpath.internal.path.CompiledPath - Evaluating path: $['data']['requestId']
- [INFO] Tests run: 6, Failures: 0, Errors: 0, Skipped: 0, Time elapsed: 1.498 s - in com.zksy.web.controller.cockpit.CockpitFacilityGeometryControllerTest
- [INFO] Running com.zksy.web.controller.cockpit.CockpitFacilityGeometryServiceTest
- 17:12:02.867 [main] ERROR com.zksy.cockpit.geometry.CockpitFacilityGeometryService - Facility geometry source read failed
- java.lang.IllegalStateException: private database detail
- at com.zksy.cockpit.geometry.CockpitFacilityGeometryService.load(CockpitFacilityGeometryService.java:60)
- at org.junit.jupiter.api.AssertThrows.assertThrows(AssertThrows.java:55)
- at org.junit.jupiter.api.AssertThrows.assertThrows(AssertThrows.java:37)
- at org.junit.jupiter.api.Assertions.assertThrows(Assertions.java:3007)
- at com.zksy.web.controller.cockpit.CockpitFacilityGeometryServiceTest.aFailedSourceNeverProducesAnEmptyOrPartialSuccess(CockpitFacilityGeometryServiceTest.java:248)
- at java.base/jdk.internal.reflect.NativeMethodAccessorImpl.invoke0(Native Method)
- at java.base/jdk.internal.reflect.NativeMethodAccessorImpl.invoke(NativeMethodAccessorImpl.java:77)
- at java.base/jdk.internal.reflect.DelegatingMethodAccessorImpl.invoke(DelegatingMethodAccessorImpl.java:43)
- at java.base/java.lang.reflect.Method.invoke(Method.java:568)
- at org.junit.platform.commons.util.ReflectionUtils.invokeMethod(ReflectionUtils.java:688)
- at org.junit.jupiter.engine.execution.MethodInvocation.proceed(MethodInvocation.java:60)
- at org.junit.jupiter.engine.execution.InvocationInterceptorChain$ValidatingInvocation.proceed(InvocationInterceptorChain.java:131)
- at org.junit.jupiter.engine.extension.TimeoutExtension.intercept(TimeoutExtension.java:149)
- at org.junit.jupiter.engine.extension.TimeoutExtension.interceptTestableMethod(TimeoutExtension.java:140)
- at org.junit.jupiter.engine.extension.TimeoutExtension.interceptTestMethod(TimeoutExtension.java:84)
- at org.junit.jupiter.engine.execution.ExecutableInvoker$ReflectiveInterceptorCall.lambda$ofVoidMethod$0(ExecutableInvoker.java:115)
- at org.junit.jupiter.engine.execution.ExecutableInvoker.lambda$invoke$0(ExecutableInvoker.java:105)
- at org.junit.jupiter.engine.execution.InvocationInterceptorChain$InterceptedInvocation.proceed(InvocationInterceptorChain.java:106)
- at org.junit.jupiter.engine.execution.InvocationInterceptorChain.proceed(InvocationInterceptorChain.java:64)
- at org.junit.jupiter.engine.execution.InvocationInterceptorChain.chainAndInvoke(InvocationInterceptorChain.java:45)
- at org.junit.jupiter.engine.execution.InvocationInterceptorChain.invoke(InvocationInterceptorChain.java:37)
- at org.junit.jupiter.engine.execution.ExecutableInvoker.invoke(ExecutableInvoker.java:104)
- at org.junit.jupiter.engine.execution.ExecutableInvoker.invoke(ExecutableInvoker.java:98)
- at org.junit.jupiter.engine.descriptor.TestMethodTestDescriptor.lambda$invokeTestMethod$6(TestMethodTestDescriptor.java:210)
- at org.junit.platform.engine.support.hierarchical.ThrowableCollector.execute(ThrowableCollector.java:73)
- at org.junit.jupiter.engine.descriptor.TestMethodTestDescriptor.invokeTestMethod(TestMethodTestDescriptor.java:206)
- at org.junit.jupiter.engine.descriptor.TestMethodTestDescriptor.execute(TestMethodTestDescriptor.java:131)
- at org.junit.jupiter.engine.descriptor.TestMethodTestDescriptor.execute(TestMethodTestDescriptor.java:65)
- at org.junit.platform.engine.support.hierarchical.NodeTestTask.lambda$executeRecursively$5(NodeTestTask.java:139)
- at org.junit.platform.engine.support.hierarchical.ThrowableCollector.execute(ThrowableCollector.java:73)
- at org.junit.platform.engine.support.hierarchical.NodeTestTask.lambda$executeRecursively$7(NodeTestTask.java:129)
- at org.junit.platform.engine.support.hierarchical.Node.around(Node.java:137)
- at org.junit.platform.engine.support.hierarchical.NodeTestTask.lambda$executeRecursively$8(NodeTestTask.java:127)
- at org.junit.platform.engine.support.hierarchical.ThrowableCollector.execute(ThrowableCollector.java:73)
- at org.junit.platform.engine.support.hierarchical.NodeTestTask.executeRecursively(NodeTestTask.java:126)
- at org.junit.platform.engine.support.hierarchical.NodeTestTask.execute(NodeTestTask.java:84)
- at java.base/java.util.ArrayList.forEach(ArrayList.java:1511)
- at org.junit.platform.engine.support.hierarchical.SameThreadHierarchicalTestExecutorService.invokeAll(SameThreadHierarchicalTestExecutorService.java:38)
- at org.junit.platform.engine.support.hierarchical.NodeTestTask.lambda$executeRecursively$5(NodeTestTask.java:143)
- at org.junit.platform.engine.support.hierarchical.ThrowableCollector.execute(ThrowableCollector.java:73)
- at org.junit.platform.engine.support.hierarchical.NodeTestTask.lambda$executeRecursively$7(NodeTestTask.java:129)
- at org.junit.platform.engine.support.hierarchical.Node.around(Node.java:137)
- at org.junit.platform.engine.support.hierarchical.NodeTestTask.lambda$executeRecursively$8(NodeTestTask.java:127)
- at org.junit.platform.engine.support.hierarchical.ThrowableCollector.execute(ThrowableCollector.java:73)
- at org.junit.platform.engine.support.hierarchical.NodeTestTask.executeRecursively(NodeTestTask.java:126)
- at org.junit.platform.engine.support.hierarchical.NodeTestTask.execute(NodeTestTask.java:84)
- at java.base/java.util.ArrayList.forEach(ArrayList.java:1511)
- at org.junit.platform.engine.support.hierarchical.SameThreadHierarchicalTestExecutorService.invokeAll(SameThreadHierarchicalTestExecutorService.java:38)
- at org.junit.platform.engine.support.hierarchical.NodeTestTask.lambda$executeRecursively$5(NodeTestTask.java:143)
- at org.junit.platform.engine.support.hierarchical.ThrowableCollector.execute(ThrowableCollector.java:73)
- at org.junit.platform.engine.support.hierarchical.NodeTestTask.lambda$executeRecursively$7(NodeTestTask.java:129)
- at org.junit.platform.engine.support.hierarchical.Node.around(Node.java:137)
- at org.junit.platform.engine.support.hierarchical.NodeTestTask.lambda$executeRecursively$8(NodeTestTask.java:127)
- at org.junit.platform.engine.support.hierarchical.ThrowableCollector.execute(ThrowableCollector.java:73)
- at org.junit.platform.engine.support.hierarchical.NodeTestTask.executeRecursively(NodeTestTask.java:126)
- at org.junit.platform.engine.support.hierarchical.NodeTestTask.execute(NodeTestTask.java:84)
- at org.junit.platform.engine.support.hierarchical.SameThreadHierarchicalTestExecutorService.submit(SameThreadHierarchicalTestExecutorService.java:32)
- at org.junit.platform.engine.support.hierarchical.HierarchicalTestExecutor.execute(HierarchicalTestExecutor.java:57)
- at org.junit.platform.engine.support.hierarchical.HierarchicalTestEngine.execute(HierarchicalTestEngine.java:51)
- at org.junit.platform.launcher.core.DefaultLauncher.execute(DefaultLauncher.java:220)
- at org.junit.platform.launcher.core.DefaultLauncher.lambda$execute$6(DefaultLauncher.java:188)
- at org.junit.platform.launcher.core.DefaultLauncher.withInterceptedStreams(DefaultLauncher.java:202)
- at org.junit.platform.launcher.core.DefaultLauncher.execute(DefaultLauncher.java:181)
- at org.junit.platform.launcher.core.DefaultLauncher.execute(DefaultLauncher.java:128)
- at org.apache.maven.surefire.junitplatform.JUnitPlatformProvider.invokeAllTests(JUnitPlatformProvider.java:150)
- at org.apache.maven.surefire.junitplatform.JUnitPlatformProvider.invoke(JUnitPlatformProvider.java:124)
- at org.apache.maven.surefire.booter.ForkedBooter.invokeProviderInSameClassLoader(ForkedBooter.java:384)
- at org.apache.maven.surefire.booter.ForkedBooter.runSuitesInProcess(ForkedBooter.java:345)
- at org.apache.maven.surefire.booter.ForkedBooter.execute(ForkedBooter.java:126)
- at org.apache.maven.surefire.booter.ForkedBooter.main(ForkedBooter.java:418)
- 17:12:02.882 [main] ERROR com.zksy.cockpit.geometry.CockpitFacilityGeometryService - Facility geometry source read failed
- java.lang.NullPointerException: null
- at java.base/java.util.Objects.requireNonNull(Objects.java:208)
- at com.zksy.cockpit.geometry.CockpitFacilityGeometryService.load(CockpitFacilityGeometryService.java:66)
- at org.junit.jupiter.api.AssertThrows.assertThrows(AssertThrows.java:55)
- at org.junit.jupiter.api.AssertThrows.assertThrows(AssertThrows.java:37)
- at org.junit.jupiter.api.Assertions.assertThrows(Assertions.java:3007)
- at com.zksy.web.controller.cockpit.CockpitFacilityGeometryServiceTest.aNullSourceIsAReadFailureRatherThanASuccessfulEmptyCollection(CockpitFacilityGeometryServiceTest.java:256)
- at java.base/jdk.internal.reflect.NativeMethodAccessorImpl.invoke0(Native Method)
- at java.base/jdk.internal.reflect.NativeMethodAccessorImpl.invoke(NativeMethodAccessorImpl.java:77)
- at java.base/jdk.internal.reflect.DelegatingMethodAccessorImpl.invoke(DelegatingMethodAccessorImpl.java:43)
- at java.base/java.lang.reflect.Method.invoke(Method.java:568)
- at org.junit.platform.commons.util.ReflectionUtils.invokeMethod(ReflectionUtils.java:688)
- at org.junit.jupiter.engine.execution.MethodInvocation.proceed(MethodInvocation.java:60)
- at org.junit.jupiter.engine.execution.InvocationInterceptorChain$ValidatingInvocation.proceed(InvocationInterceptorChain.java:131)
- at org.junit.jupiter.engine.extension.TimeoutExtension.intercept(TimeoutExtension.java:149)
- at org.junit.jupiter.engine.extension.TimeoutExtension.interceptTestableMethod(TimeoutExtension.java:140)
- at org.junit.jupiter.engine.extension.TimeoutExtension.interceptTestMethod(TimeoutExtension.java:84)
- at org.junit.jupiter.engine.execution.ExecutableInvoker$ReflectiveInterceptorCall.lambda$ofVoidMethod$0(ExecutableInvoker.java:115)
- at org.junit.jupiter.engine.execution.ExecutableInvoker.lambda$invoke$0(ExecutableInvoker.java:105)
- at org.junit.jupiter.engine.execution.InvocationInterceptorChain$InterceptedInvocation.proceed(InvocationInterceptorChain.java:106)
- at org.junit.jupiter.engine.execution.InvocationInterceptorChain.proceed(InvocationInterceptorChain.java:64)
- at org.junit.jupiter.engine.execution.InvocationInterceptorChain.chainAndInvoke(InvocationInterceptorChain.java:45)
- at org.junit.jupiter.engine.execution.InvocationInterceptorChain.invoke(InvocationInterceptorChain.java:37)
- at org.junit.jupiter.engine.execution.ExecutableInvoker.invoke(ExecutableInvoker.java:104)
- at org.junit.jupiter.engine.execution.ExecutableInvoker.invoke(ExecutableInvoker.java:98)
- at org.junit.jupiter.engine.descriptor.TestMethodTestDescriptor.lambda$invokeTestMethod$6(TestMethodTestDescriptor.java:210)
- at org.junit.platform.engine.support.hierarchical.ThrowableCollector.execute(ThrowableCollector.java:73)
- at org.junit.jupiter.engine.descriptor.TestMethodTestDescriptor.invokeTestMethod(TestMethodTestDescriptor.java:206)
- at org.junit.jupiter.engine.descriptor.TestMethodTestDescriptor.execute(TestMethodTestDescriptor.java:131)
- at org.junit.jupiter.engine.descriptor.TestMethodTestDescriptor.execute(TestMethodTestDescriptor.java:65)
- at org.junit.platform.engine.support.hierarchical.NodeTestTask.lambda$executeRecursively$5(NodeTestTask.java:139)
- at org.junit.platform.engine.support.hierarchical.ThrowableCollector.execute(ThrowableCollector.java:73)
- at org.junit.platform.engine.support.hierarchical.NodeTestTask.lambda$executeRecursively$7(NodeTestTask.java:129)
- at org.junit.platform.engine.support.hierarchical.Node.around(Node.java:137)
- at org.junit.platform.engine.support.hierarchical.NodeTestTask.lambda$executeRecursively$8(NodeTestTask.java:127)
- at org.junit.platform.engine.support.hierarchical.ThrowableCollector.execute(ThrowableCollector.java:73)
- at org.junit.platform.engine.support.hierarchical.NodeTestTask.executeRecursively(NodeTestTask.java:126)
- at org.junit.platform.engine.support.hierarchical.NodeTestTask.execute(NodeTestTask.java:84)
- at java.base/java.util.ArrayList.forEach(ArrayList.java:1511)
- at org.junit.platform.engine.support.hierarchical.SameThreadHierarchicalTestExecutorService.invokeAll(SameThreadHierarchicalTestExecutorService.java:38)
- at org.junit.platform.engine.support.hierarchical.NodeTestTask.lambda$executeRecursively$5(NodeTestTask.java:143)
- at org.junit.platform.engine.support.hierarchical.ThrowableCollector.execute(ThrowableCollector.java:73)
- at org.junit.platform.engine.support.hierarchical.NodeTestTask.lambda$executeRecursively$7(NodeTestTask.java:129)
- at org.junit.platform.engine.support.hierarchical.Node.around(Node.java:137)
- at org.junit.platform.engine.support.hierarchical.NodeTestTask.lambda$executeRecursively$8(NodeTestTask.java:127)
- at org.junit.platform.engine.support.hierarchical.ThrowableCollector.execute(ThrowableCollector.java:73)
- at org.junit.platform.engine.support.hierarchical.NodeTestTask.executeRecursively(NodeTestTask.java:126)
- at org.junit.platform.engine.support.hierarchical.NodeTestTask.execute(NodeTestTask.java:84)
- at java.base/java.util.ArrayList.forEach(ArrayList.java:1511)
- at org.junit.platform.engine.support.hierarchical.SameThreadHierarchicalTestExecutorService.invokeAll(SameThreadHierarchicalTestExecutorService.java:38)
- at org.junit.platform.engine.support.hierarchical.NodeTestTask.lambda$executeRecursively$5(NodeTestTask.java:143)
- at org.junit.platform.engine.support.hierarchical.ThrowableCollector.execute(ThrowableCollector.java:73)
- at org.junit.platform.engine.support.hierarchical.NodeTestTask.lambda$executeRecursively$7(NodeTestTask.java:129)
- at org.junit.platform.engine.support.hierarchical.Node.around(Node.java:137)
- at org.junit.platform.engine.support.hierarchical.NodeTestTask.lambda$executeRecursively$8(NodeTestTask.java:127)
- at org.junit.platform.engine.support.hierarchical.ThrowableCollector.execute(ThrowableCollector.java:73)
- at org.junit.platform.engine.support.hierarchical.NodeTestTask.executeRecursively(NodeTestTask.java:126)
- at org.junit.platform.engine.support.hierarchical.NodeTestTask.execute(NodeTestTask.java:84)
- at org.junit.platform.engine.support.hierarchical.SameThreadHierarchicalTestExecutorService.submit(SameThreadHierarchicalTestExecutorService.java:32)
- at org.junit.platform.engine.support.hierarchical.HierarchicalTestExecutor.execute(HierarchicalTestExecutor.java:57)
- at org.junit.platform.engine.support.hierarchical.HierarchicalTestEngine.execute(HierarchicalTestEngine.java:51)
- at org.junit.platform.launcher.core.DefaultLauncher.execute(DefaultLauncher.java:220)
- at org.junit.platform.launcher.core.DefaultLauncher.lambda$execute$6(DefaultLauncher.java:188)
- at org.junit.platform.launcher.core.DefaultLauncher.withInterceptedStreams(DefaultLauncher.java:202)
- at org.junit.platform.launcher.core.DefaultLauncher.execute(DefaultLauncher.java:181)
- at org.junit.platform.launcher.core.DefaultLauncher.execute(DefaultLauncher.java:128)
- at org.apache.maven.surefire.junitplatform.JUnitPlatformProvider.invokeAllTests(JUnitPlatformProvider.java:150)
- at org.apache.maven.surefire.junitplatform.JUnitPlatformProvider.invoke(JUnitPlatformProvider.java:124)
- at org.apache.maven.surefire.booter.ForkedBooter.invokeProviderInSameClassLoader(ForkedBooter.java:384)
- at org.apache.maven.surefire.booter.ForkedBooter.runSuitesInProcess(ForkedBooter.java:345)
- at org.apache.maven.surefire.booter.ForkedBooter.execute(ForkedBooter.java:126)
- at org.apache.maven.surefire.booter.ForkedBooter.main(ForkedBooter.java:418)
- [INFO] Tests run: 16, Failures: 0, Errors: 0, Skipped: 0, Time elapsed: 0.079 s - in com.zksy.web.controller.cockpit.CockpitFacilityGeometryServiceTest
- [INFO]
- [INFO] Results:
- [INFO]
- [INFO] Tests run: 22, Failures: 0, Errors: 0, Skipped: 0
- [INFO]
- [INFO] ------------------------------------------------------------------------
- [INFO] Reactor Summary:
- [INFO]
- [INFO] pipe-ner-server 1.0.0 .............................. SUCCESS [ 0.001 s]
- [INFO] pipe-network-service 3.9.0 ......................... SUCCESS [ 0.001 s]
- [INFO] zksy-common 3.9.0 .................................. SUCCESS [ 1.061 s]
- [INFO] zksy-system 3.9.0 .................................. SUCCESS [ 12.305 s]
- [INFO] zksy-framework 3.9.0 ............................... SUCCESS [ 0.146 s]
- [INFO] zksy-quartz 3.9.0 .................................. SUCCESS [ 1.018 s]
- [INFO] zksy-generator 3.9.0 ............................... SUCCESS [ 0.072 s]
- [INFO] zksy-admin 3.9.0 ................................... SUCCESS [ 7.792 s]
- [INFO] ------------------------------------------------------------------------
- [INFO] BUILD SUCCESS
- [INFO] ------------------------------------------------------------------------
- [INFO] Total time: 22.763 s
- [INFO] Finished at: 2026-10-13T17:12:03+08:00
- [INFO] ------------------------------------------------------------------------
|