| 123456789101112131415161718192021222324252627282930313233343536373839404142434445464748495051525354555657585960616263646566676869707172737475767778798081828384858687888990919293949596979899100101102103104105106107108109110111112113114115116117118119120121122123124125126127128129130131132133134135136137138139140141142143144145146147148149150151152153154155156157158159160161162163164165166167168169170171172173174175176177178179180181182183184185186187188189190191192193194195196197198199200201202203204205206207208209210211212213214215216217218219220221222223224225226227228229230231232233234235236237238239240241242243244245246247248249250251252253254255256257258259260261262263264265266267268269270271272273274275276277278279280281282283284285286287288289290291292293294295296297298299300301302303304305306307308309310311312313314315316317318319320321322323324325326327328329330331332333334335336337338339340341342343344345346347348349350351352353354355356357358359360361362363364365366367368369370371372373374375376377378379380381382383384385386387388389390391392393394395396397398399400401402403404405406407408409410411412413414415416417418419420421422423424425426427428429430431432433434435436437438439440441442443444445446447448449450451452453454455456457458459460461462463464465466467468469470471472473474475476477478479480481482483484485486487488489490491492493494495496497498499500501502503504505506507508509510511512513514515516517518519520521522523524525526527528529530531532533534535536537538539540541542543544545546547548549550551552553554555556557558559560561562563564565566567568569570571572573574575576577578579580581582583584585586587588589590591592593594595596597598599600601602603604605606607608609610611612613614615616617618619620621622623624625626627628629630631632633634635636637638639640641642643644645646647648649650651652653654655656657658659660661662663664665666667668669670671672673674675676677678679680681682683684685686687688689690691692693694695696697698699700701702703704705706707708709710711712713714715716717718719720721722723724725726727728729730731732733734735736737738739740741742743744745746747748749750751752753754755756757758759760761762763764765766767768769770771772773774775776777778779780781782783784785786787788789790791792793794795796797798799800801802803804805806807808809810811812813814815816817818819820821822823824825826827828829830831832833834835836837838839840841 |
- [INFO] Scanning for projects...
- [INFO] ------------------------------------------------------------------------
- [INFO] Reactor Build Order:
- [INFO]
- [INFO] pipe-ner-server [pom]
- [INFO] pipe-network-service [pom]
- [INFO] zksy-common [jar]
- [INFO] zksy-system [jar]
- [INFO] zksy-framework [jar]
- [INFO] zksy-quartz [jar]
- [INFO] zksy-generator [jar]
- [INFO] zksy-admin [jar]
- [INFO]
- [INFO] ----------------------< com.zksy:pipe-ner-server >----------------------
- [INFO] Building pipe-ner-server 1.0.0 [1/8]
- [INFO] from pom.xml
- [INFO] --------------------------------[ pom ]---------------------------------
- [INFO]
- [INFO] -------------------< com.zksy:pipe-network-service >--------------------
- [INFO] Building pipe-network-service 3.9.0 [2/8]
- [INFO] from pipe-network-service\pom.xml
- [INFO] --------------------------------[ pom ]---------------------------------
- [INFO]
- [INFO] ------------------------< com.zksy:zksy-common >------------------------
- [INFO] Building zksy-common 3.9.0 [3/8]
- [INFO] from pipe-network-service\zksy-common\pom.xml
- [INFO] --------------------------------[ jar ]---------------------------------
- [WARNING] Parameter 'parameters' is unknown for plugin 'maven-compiler-plugin:3.1:compile (default-compile)'
- [WARNING] Parameter 'parameters' is unknown for plugin 'maven-compiler-plugin:3.1:testCompile (default-testCompile)'
- [INFO]
- [INFO] --- resources:3.2.0:resources (default-resources) @ zksy-common ---
- [INFO] Using 'UTF-8' encoding to copy filtered resources.
- [INFO] Using 'UTF-8' encoding to copy filtered properties files.
- [INFO] skip non existing resourceDirectory E:\pipe-ner-server\pipe-network-service\zksy-common\src\main\resources
- [INFO] skip non existing resourceDirectory E:\pipe-ner-server\pipe-network-service\zksy-common\src\main\resources
- [INFO]
- [INFO] --- compiler:3.1:compile (default-compile) @ zksy-common ---
- [INFO] Nothing to compile - all classes are up to date
- [INFO]
- [INFO] --- resources:3.2.0:testResources (default-testResources) @ zksy-common ---
- [INFO] Using 'UTF-8' encoding to copy filtered resources.
- [INFO] Using 'UTF-8' encoding to copy filtered properties files.
- [INFO] skip non existing resourceDirectory E:\pipe-ner-server\pipe-network-service\zksy-common\src\test\resources
- [INFO]
- [INFO] --- compiler:3.1:testCompile (default-testCompile) @ zksy-common ---
- [INFO] No sources to compile
- [INFO]
- [INFO] --- surefire:2.22.2:test (default-test) @ zksy-common ---
- [INFO] No tests to run.
- [INFO]
- [INFO] ------------------------< com.zksy:zksy-system >------------------------
- [INFO] Building zksy-system 3.9.0 [4/8]
- [INFO] from pipe-network-service\zksy-system\pom.xml
- [INFO] --------------------------------[ jar ]---------------------------------
- [WARNING] Parameter 'parameters' is unknown for plugin 'maven-compiler-plugin:3.1:compile (default-compile)'
- [WARNING] Parameter 'parameters' is unknown for plugin 'maven-compiler-plugin:3.1:testCompile (default-testCompile)'
- [INFO]
- [INFO] --- resources:3.2.0:resources (default-resources) @ zksy-system ---
- [INFO] Using 'UTF-8' encoding to copy filtered resources.
- [INFO] Using 'UTF-8' encoding to copy filtered properties files.
- [INFO] Copying 0 resource
- [INFO] Copying 46 resources
- [INFO]
- [INFO] --- compiler:3.1:compile (default-compile) @ zksy-system ---
- [INFO] Changes detected - recompiling the module!
- [INFO] Compiling 761 source files to E:\pipe-ner-server\pipe-network-service\zksy-system\target\classes
- [WARNING] /E:/pipe-ner-server/pipe-network-service/zksy-system/src/main/java/com/zksy/base/video/VideoCollectorClient.java: E:\pipe-ner-server\pipe-network-service\zksy-system\src\main\java\com\zksy\base\video\VideoCollectorClient.java使用了未经检查或不安全的操作。
- [WARNING] /E:/pipe-ner-server/pipe-network-service/zksy-system/src/main/java/com/zksy/base/video/VideoCollectorClient.java: 有关详细信息, 请使用 -Xlint:unchecked 重新编译。
- [INFO]
- [INFO] --- resources:3.2.0:testResources (default-testResources) @ zksy-system ---
- [INFO] Using 'UTF-8' encoding to copy filtered resources.
- [INFO] Using 'UTF-8' encoding to copy filtered properties files.
- [INFO] skip non existing resourceDirectory E:\pipe-ner-server\pipe-network-service\zksy-system\src\test\resources
- [INFO]
- [INFO] --- compiler:3.1:testCompile (default-testCompile) @ zksy-system ---
- [INFO] Changes detected - recompiling the module!
- [INFO] Compiling 30 source files to E:\pipe-ner-server\pipe-network-service\zksy-system\target\test-classes
- [WARNING] /E:/pipe-ner-server/pipe-network-service/zksy-system/src/test/java/com/zksy/base/alarm/service/AlarmLifecycleServiceTest.java: E:\pipe-ner-server\pipe-network-service\zksy-system\src\test\java\com\zksy\base\alarm\service\AlarmLifecycleServiceTest.java使用或覆盖了已过时的 API。
- [WARNING] /E:/pipe-ner-server/pipe-network-service/zksy-system/src/test/java/com/zksy/base/alarm/service/AlarmLifecycleServiceTest.java: 有关详细信息, 请使用 -Xlint:deprecation 重新编译。
- [WARNING] /E:/pipe-ner-server/pipe-network-service/zksy-system/src/test/java/com/zksy/ops/service/impl/WorkOrderServiceImplTest.java: 某些输入文件使用了未经检查或不安全的操作。
- [WARNING] /E:/pipe-ner-server/pipe-network-service/zksy-system/src/test/java/com/zksy/ops/service/impl/WorkOrderServiceImplTest.java: 有关详细信息, 请使用 -Xlint:unchecked 重新编译。
- [INFO]
- [INFO] --- surefire:2.22.2:test (default-test) @ zksy-system ---
- [INFO]
- [INFO] ----------------------< com.zksy:zksy-framework >-----------------------
- [INFO] Building zksy-framework 3.9.0 [5/8]
- [INFO] from pipe-network-service\zksy-framework\pom.xml
- [INFO] --------------------------------[ jar ]---------------------------------
- [WARNING] Parameter 'parameters' is unknown for plugin 'maven-compiler-plugin:3.1:compile (default-compile)'
- [WARNING] Parameter 'parameters' is unknown for plugin 'maven-compiler-plugin:3.1:testCompile (default-testCompile)'
- [INFO]
- [INFO] --- resources:3.2.0:resources (default-resources) @ zksy-framework ---
- [INFO] Using 'UTF-8' encoding to copy filtered resources.
- [INFO] Using 'UTF-8' encoding to copy filtered properties files.
- [INFO] skip non existing resourceDirectory E:\pipe-ner-server\pipe-network-service\zksy-framework\src\main\resources
- [INFO] skip non existing resourceDirectory E:\pipe-ner-server\pipe-network-service\zksy-framework\src\main\resources
- [INFO]
- [INFO] --- compiler:3.1:compile (default-compile) @ zksy-framework ---
- [INFO] Nothing to compile - all classes are up to date
- [INFO]
- [INFO] --- resources:3.2.0:testResources (default-testResources) @ zksy-framework ---
- [INFO] Using 'UTF-8' encoding to copy filtered resources.
- [INFO] Using 'UTF-8' encoding to copy filtered properties files.
- [INFO] skip non existing resourceDirectory E:\pipe-ner-server\pipe-network-service\zksy-framework\src\test\resources
- [INFO]
- [INFO] --- compiler:3.1:testCompile (default-testCompile) @ zksy-framework ---
- [INFO] No sources to compile
- [INFO]
- [INFO] --- surefire:2.22.2:test (default-test) @ zksy-framework ---
- [INFO] No tests to run.
- [INFO]
- [INFO] ------------------------< com.zksy:zksy-quartz >------------------------
- [INFO] Building zksy-quartz 3.9.0 [6/8]
- [INFO] from pipe-network-service\zksy-quartz\pom.xml
- [INFO] --------------------------------[ jar ]---------------------------------
- [WARNING] Parameter 'parameters' is unknown for plugin 'maven-compiler-plugin:3.1:compile (default-compile)'
- [WARNING] Parameter 'parameters' is unknown for plugin 'maven-compiler-plugin:3.1:testCompile (default-testCompile)'
- [INFO]
- [INFO] --- resources:3.2.0:resources (default-resources) @ zksy-quartz ---
- [INFO] Using 'UTF-8' encoding to copy filtered resources.
- [INFO] Using 'UTF-8' encoding to copy filtered properties files.
- [INFO] Copying 0 resource
- [INFO] Copying 2 resources
- [INFO]
- [INFO] --- compiler:3.1:compile (default-compile) @ zksy-quartz ---
- [INFO] Changes detected - recompiling the module!
- [INFO] Compiling 18 source files to E:\pipe-ner-server\pipe-network-service\zksy-quartz\target\classes
- [INFO]
- [INFO] --- resources:3.2.0:testResources (default-testResources) @ zksy-quartz ---
- [INFO] Using 'UTF-8' encoding to copy filtered resources.
- [INFO] Using 'UTF-8' encoding to copy filtered properties files.
- [INFO] skip non existing resourceDirectory E:\pipe-ner-server\pipe-network-service\zksy-quartz\src\test\resources
- [INFO]
- [INFO] --- compiler:3.1:testCompile (default-testCompile) @ zksy-quartz ---
- [INFO] No sources to compile
- [INFO]
- [INFO] --- surefire:2.22.2:test (default-test) @ zksy-quartz ---
- [INFO] No tests to run.
- [INFO]
- [INFO] ----------------------< com.zksy:zksy-generator >-----------------------
- [INFO] Building zksy-generator 3.9.0 [7/8]
- [INFO] from pipe-network-service\zksy-generator\pom.xml
- [INFO] --------------------------------[ jar ]---------------------------------
- [WARNING] Parameter 'parameters' is unknown for plugin 'maven-compiler-plugin:3.1:compile (default-compile)'
- [WARNING] Parameter 'parameters' is unknown for plugin 'maven-compiler-plugin:3.1:testCompile (default-testCompile)'
- [INFO]
- [INFO] --- resources:3.2.0:resources (default-resources) @ zksy-generator ---
- [INFO] Using 'UTF-8' encoding to copy filtered resources.
- [INFO] Using 'UTF-8' encoding to copy filtered properties files.
- [INFO] Copying 0 resource
- [INFO] Copying 16 resources
- [INFO]
- [INFO] --- compiler:3.1:compile (default-compile) @ zksy-generator ---
- [INFO] Nothing to compile - all classes are up to date
- [INFO]
- [INFO] --- resources:3.2.0:testResources (default-testResources) @ zksy-generator ---
- [INFO] Using 'UTF-8' encoding to copy filtered resources.
- [INFO] Using 'UTF-8' encoding to copy filtered properties files.
- [INFO] skip non existing resourceDirectory E:\pipe-ner-server\pipe-network-service\zksy-generator\src\test\resources
- [INFO]
- [INFO] --- compiler:3.1:testCompile (default-testCompile) @ zksy-generator ---
- [INFO] No sources to compile
- [INFO]
- [INFO] --- surefire:2.22.2:test (default-test) @ zksy-generator ---
- [INFO] No tests to run.
- [INFO]
- [INFO] ------------------------< com.zksy:zksy-admin >-------------------------
- [INFO] Building zksy-admin 3.9.0 [8/8]
- [INFO] from pipe-network-service\zksy-admin\pom.xml
- [INFO] --------------------------------[ jar ]---------------------------------
- [WARNING] Parameter 'parameters' is unknown for plugin 'maven-compiler-plugin:3.1:compile (default-compile)'
- [WARNING] Parameter 'parameters' is unknown for plugin 'maven-compiler-plugin:3.1:testCompile (default-testCompile)'
- [WARNING] 1 problem was encountered while building the effective model for org.javassist:javassist:jar:3.21.0-GA during dependency collection step for project (use -X to see details)
- [INFO]
- [INFO] --- resources:3.2.0:resources (default-resources) @ zksy-admin ---
- [INFO] Using 'UTF-8' encoding to copy filtered resources.
- [INFO] Using 'UTF-8' encoding to copy filtered properties files.
- [INFO] Copying 4 resources
- [INFO] Copying 6 resources
- [INFO]
- [INFO] --- compiler:3.1:compile (default-compile) @ zksy-admin ---
- [INFO] Changes detected - recompiling the module!
- [INFO] Compiling 146 source files to E:\pipe-ner-server\pipe-network-service\zksy-admin\target\classes
- [INFO]
- [INFO] --- resources:3.2.0:testResources (default-testResources) @ zksy-admin ---
- [INFO] Using 'UTF-8' encoding to copy filtered resources.
- [INFO] Using 'UTF-8' encoding to copy filtered properties files.
- [INFO] skip non existing resourceDirectory E:\pipe-ner-server\pipe-network-service\zksy-admin\src\test\resources
- [INFO]
- [INFO] --- compiler:3.1:testCompile (default-testCompile) @ zksy-admin ---
- [INFO] Changes detected - recompiling the module!
- [INFO] Compiling 67 source files to E:\pipe-ner-server\pipe-network-service\zksy-admin\target\test-classes
- [WARNING] /E:/pipe-ner-server/pipe-network-service/zksy-admin/src/test/java/com/zksy/web/controller/cockpit/BusinessCockpitOverviewWarningSettingsAdapterTest.java: 某些输入文件使用了未经检查或不安全的操作。
- [WARNING] /E:/pipe-ner-server/pipe-network-service/zksy-admin/src/test/java/com/zksy/web/controller/cockpit/BusinessCockpitOverviewWarningSettingsAdapterTest.java: 有关详细信息, 请使用 -Xlint:unchecked 重新编译。
- [INFO]
- [INFO] --- surefire:2.22.2:test (default-test) @ zksy-admin ---
- [INFO]
- [INFO] -------------------------------------------------------
- [INFO] T E S T S
- [INFO] -------------------------------------------------------
- [INFO] Running com.zksy.web.controller.cockpit.CockpitFacilityGeometryControllerTest
- 16:02:56.682 [main] DEBUG org.jboss.logging - Logging Provider: org.jboss.logging.Log4j2LoggerProvider
- 16:02:56.685 [main] INFO org.hibernate.validator.internal.util.Version - HV000001: Hibernate Validator 6.2.5.Final
- 16:02:56.703 [main] DEBUG org.hibernate.validator.messageinterpolation.ResourceBundleMessageInterpolator - Loaded expression factory via original TCCL
- 16:02:56.703 [main] DEBUG org.hibernate.validator.internal.engine.AbstractConfigurationImpl - Setting custom MessageInterpolator of type org.springframework.validation.beanvalidation.LocaleContextMessageInterpolator
- 16:02:56.703 [main] DEBUG org.hibernate.validator.internal.engine.AbstractConfigurationImpl - Setting custom ParameterNameProvider of type org.springframework.validation.beanvalidation.LocalValidatorFactoryBean$1
- 16:02:56.708 [main] DEBUG org.hibernate.validator.internal.xml.config.ValidationXmlParser - Trying to load META-INF/validation.xml for XML based Validator configuration.
- 16:02:56.709 [main] DEBUG org.hibernate.validator.internal.xml.config.ResourceLoaderHelper - Trying to load META-INF/validation.xml via TCCL
- 16:02:56.709 [main] DEBUG org.hibernate.validator.internal.xml.config.ResourceLoaderHelper - Trying to load META-INF/validation.xml via Hibernate Validator's class loader
- 16:02:56.709 [main] DEBUG org.hibernate.validator.internal.xml.config.ValidationXmlParser - No META-INF/validation.xml found. Using annotation based configuration only.
- 16:02:56.712 [main] DEBUG org.hibernate.validator.internal.engine.resolver.TraversableResolvers - Cannot find javax.persistence.Persistence on classpath. Assuming non JPA 2 environment. All properties will per default be traversable.
- 16:02:56.798 [main] DEBUG org.hibernate.validator.internal.engine.ValidatorFactoryConfigurationHelper - HV000252: Using org.hibernate.validator.internal.engine.DefaultPropertyNodeNameProvider as property node name provider.
- 16:02:56.802 [main] DEBUG org.hibernate.validator.internal.engine.ValidatorFactoryConfigurationHelper - HV000234: Using org.springframework.validation.beanvalidation.LocaleContextMessageInterpolator as ValidatorFactory-scoped message interpolator.
- 16:02:56.802 [main] DEBUG org.hibernate.validator.internal.engine.ValidatorFactoryConfigurationHelper - HV000234: Using org.hibernate.validator.internal.engine.resolver.TraverseAllTraversableResolver as ValidatorFactory-scoped traversable resolver.
- 16:02:56.803 [main] DEBUG org.hibernate.validator.internal.engine.ValidatorFactoryConfigurationHelper - HV000234: Using org.hibernate.validator.internal.util.ExecutableParameterNameProvider as ValidatorFactory-scoped parameter name provider.
- 16:02:56.803 [main] DEBUG org.hibernate.validator.internal.engine.ValidatorFactoryConfigurationHelper - HV000234: Using org.hibernate.validator.internal.engine.DefaultClockProvider as ValidatorFactory-scoped clock provider.
- 16:02:56.803 [main] DEBUG org.hibernate.validator.internal.engine.ValidatorFactoryConfigurationHelper - HV000234: Using org.hibernate.validator.internal.engine.scripting.DefaultScriptEvaluatorFactory as ValidatorFactory-scoped script evaluator factory.
- 16:02:56.901 [main] DEBUG _org.springframework.web.servlet.HandlerMapping.Mappings -
- c.z.w.c.c.CockpitFacilityGeometryController:
- {GET [/api/cockpit/v1/infrastructure/geometry]}: geometry()
- 16:02:56.905 [main] DEBUG org.springframework.web.servlet.mvc.method.annotation.RequestMappingHandlerMapping - 1 mappings in org.springframework.web.servlet.mvc.method.annotation.RequestMappingHandlerMapping
- 16:02:57.124 [main] DEBUG org.springframework.web.servlet.mvc.method.annotation.RequestMappingHandlerAdapter - ControllerAdvice beans: 0 @ModelAttribute, 0 @InitBinder, 1 RequestBodyAdvice, 1 ResponseBodyAdvice
- 16:02:57.145 [main] DEBUG org.springframework.web.servlet.mvc.method.annotation.ExceptionHandlerExceptionResolver - ControllerAdvice beans: 0 @ExceptionHandler, 1 ResponseBodyAdvice
- 16:02:57.160 [main] INFO org.springframework.mock.web.MockServletContext - Initializing Spring TestDispatcherServlet ''
- 16:02:57.160 [main] INFO org.springframework.test.web.servlet.TestDispatcherServlet - Initializing Servlet ''
- 16:02:57.161 [main] DEBUG org.springframework.test.web.servlet.TestDispatcherServlet - Detected AcceptHeaderLocaleResolver
- 16:02:57.161 [main] DEBUG org.springframework.test.web.servlet.TestDispatcherServlet - Detected FixedThemeResolver
- 16:02:57.162 [main] DEBUG org.springframework.test.web.servlet.TestDispatcherServlet - Detected org.springframework.web.servlet.view.DefaultRequestToViewNameTranslator@2513a118
- 16:02:57.162 [main] DEBUG org.springframework.test.web.servlet.TestDispatcherServlet - Detected org.springframework.web.servlet.support.SessionFlashMapManager@2bfb583b
- 16:02:57.162 [main] DEBUG org.springframework.test.web.servlet.TestDispatcherServlet - enableLoggingRequestDetails='false': request parameters and headers will be masked to prevent unsafe logging of potentially sensitive data
- 16:02:57.162 [main] INFO org.springframework.test.web.servlet.TestDispatcherServlet - Completed initialization in 2 ms
- 16:02:57.407 [main] DEBUG org.springframework.test.web.servlet.TestDispatcherServlet - GET "/api/cockpit/v1/infrastructure/geometry", parameters={}
- 16:02:57.410 [main] DEBUG org.springframework.web.servlet.mvc.method.annotation.RequestMappingHandlerMapping - Mapped to com.zksy.web.controller.cockpit.CockpitFacilityGeometryController#geometry()
- 16:02:57.442 [main] DEBUG org.springframework.web.servlet.mvc.method.annotation.HttpEntityMethodProcessor - Using 'application/json', given [*/*] and supported [application/json, application/*+json]
- 16:02:57.442 [main] DEBUG org.springframework.web.servlet.mvc.method.annotation.HttpEntityMethodProcessor - Writing [{msg=操作成功, code=200, data=com.zksy.cockpit.geometry.CockpitFacilityGeometryResponse@39549f33}]
- 16:02:57.458 [main] DEBUG org.springframework.test.web.servlet.TestDispatcherServlet - Completed 200 OK
- 16:02:57.490 [main] DEBUG com.jayway.jsonpath.internal.path.CompiledPath - Evaluating path: $['code']
- 16:02:57.493 [main] DEBUG com.jayway.jsonpath.internal.path.CompiledPath - Evaluating path: $['data']['type']
- 16:02:57.496 [main] DEBUG com.jayway.jsonpath.internal.path.CompiledPath - Evaluating path: $['data']['features']
- 16:02:57.497 [main] DEBUG com.jayway.jsonpath.internal.path.CompiledPath - Evaluating path: $['data']['coverage']
- 16:02:57.497 [main] DEBUG com.jayway.jsonpath.internal.path.CompiledPath - Evaluating path: $['data']['coverage'][4]['state']
- 16:02:57.503 [main] DEBUG org.hibernate.validator.messageinterpolation.ResourceBundleMessageInterpolator - Loaded expression factory via original TCCL
- 16:02:57.503 [main] DEBUG org.hibernate.validator.internal.engine.AbstractConfigurationImpl - Setting custom MessageInterpolator of type org.springframework.validation.beanvalidation.LocaleContextMessageInterpolator
- 16:02:57.503 [main] DEBUG org.hibernate.validator.internal.engine.AbstractConfigurationImpl - Setting custom ParameterNameProvider of type org.springframework.validation.beanvalidation.LocalValidatorFactoryBean$1
- 16:02:57.504 [main] DEBUG org.hibernate.validator.internal.xml.config.ValidationXmlParser - Trying to load META-INF/validation.xml for XML based Validator configuration.
- 16:02:57.504 [main] DEBUG org.hibernate.validator.internal.xml.config.ResourceLoaderHelper - Trying to load META-INF/validation.xml via TCCL
- 16:02:57.504 [main] DEBUG org.hibernate.validator.internal.xml.config.ResourceLoaderHelper - Trying to load META-INF/validation.xml via Hibernate Validator's class loader
- 16:02:57.504 [main] DEBUG org.hibernate.validator.internal.xml.config.ValidationXmlParser - No META-INF/validation.xml found. Using annotation based configuration only.
- 16:02:57.505 [main] DEBUG org.hibernate.validator.internal.engine.resolver.TraversableResolvers - Cannot find javax.persistence.Persistence on classpath. Assuming non JPA 2 environment. All properties will per default be traversable.
- 16:02:57.507 [main] DEBUG org.hibernate.validator.internal.engine.ValidatorFactoryConfigurationHelper - HV000252: Using org.hibernate.validator.internal.engine.DefaultPropertyNodeNameProvider as property node name provider.
- 16:02:57.507 [main] DEBUG org.hibernate.validator.internal.engine.ValidatorFactoryConfigurationHelper - HV000234: Using org.springframework.validation.beanvalidation.LocaleContextMessageInterpolator as ValidatorFactory-scoped message interpolator.
- 16:02:57.507 [main] DEBUG org.hibernate.validator.internal.engine.ValidatorFactoryConfigurationHelper - HV000234: Using org.hibernate.validator.internal.engine.resolver.TraverseAllTraversableResolver as ValidatorFactory-scoped traversable resolver.
- 16:02:57.507 [main] DEBUG org.hibernate.validator.internal.engine.ValidatorFactoryConfigurationHelper - HV000234: Using org.hibernate.validator.internal.util.ExecutableParameterNameProvider as ValidatorFactory-scoped parameter name provider.
- 16:02:57.507 [main] DEBUG org.hibernate.validator.internal.engine.ValidatorFactoryConfigurationHelper - HV000234: Using org.hibernate.validator.internal.engine.DefaultClockProvider as ValidatorFactory-scoped clock provider.
- 16:02:57.507 [main] DEBUG org.hibernate.validator.internal.engine.ValidatorFactoryConfigurationHelper - HV000234: Using org.hibernate.validator.internal.engine.scripting.DefaultScriptEvaluatorFactory as ValidatorFactory-scoped script evaluator factory.
- 16:02:57.508 [main] DEBUG _org.springframework.web.servlet.HandlerMapping.Mappings -
- c.z.w.c.c.CockpitFacilityGeometryController:
- {GET [/api/cockpit/v1/infrastructure/geometry]}: geometry()
- 16:02:57.509 [main] DEBUG org.springframework.web.servlet.mvc.method.annotation.RequestMappingHandlerMapping - 1 mappings in org.springframework.web.servlet.mvc.method.annotation.RequestMappingHandlerMapping
- 16:02:57.513 [main] DEBUG org.springframework.web.servlet.mvc.method.annotation.RequestMappingHandlerAdapter - ControllerAdvice beans: 0 @ModelAttribute, 0 @InitBinder, 1 RequestBodyAdvice, 1 ResponseBodyAdvice
- 16:02:57.514 [main] DEBUG org.springframework.web.servlet.mvc.method.annotation.ExceptionHandlerExceptionResolver - ControllerAdvice beans: 0 @ExceptionHandler, 1 ResponseBodyAdvice
- 16:02:57.514 [main] INFO org.springframework.mock.web.MockServletContext - Initializing Spring TestDispatcherServlet ''
- 16:02:57.514 [main] INFO org.springframework.test.web.servlet.TestDispatcherServlet - Initializing Servlet ''
- 16:02:57.514 [main] DEBUG org.springframework.test.web.servlet.TestDispatcherServlet - Detected AcceptHeaderLocaleResolver
- 16:02:57.514 [main] DEBUG org.springframework.test.web.servlet.TestDispatcherServlet - Detected FixedThemeResolver
- 16:02:57.515 [main] DEBUG org.springframework.test.web.servlet.TestDispatcherServlet - Detected org.springframework.web.servlet.view.DefaultRequestToViewNameTranslator@6ddd1c51
- 16:02:57.515 [main] DEBUG org.springframework.test.web.servlet.TestDispatcherServlet - Detected org.springframework.web.servlet.support.SessionFlashMapManager@752b69e3
- 16:02:57.515 [main] DEBUG org.springframework.test.web.servlet.TestDispatcherServlet - enableLoggingRequestDetails='false': request parameters and headers will be masked to prevent unsafe logging of potentially sensitive data
- 16:02:57.515 [main] INFO org.springframework.test.web.servlet.TestDispatcherServlet - Completed initialization in 1 ms
- 16:02:57.516 [main] DEBUG org.springframework.test.web.servlet.TestDispatcherServlet - GET "/api/cockpit/v1/infrastructure/geometry", parameters={}
- 16:02:57.516 [main] DEBUG org.springframework.web.servlet.mvc.method.annotation.RequestMappingHandlerMapping - Mapped to com.zksy.web.controller.cockpit.CockpitFacilityGeometryController#geometry()
- 16:02:57.517 [main] DEBUG org.springframework.web.servlet.mvc.method.annotation.HttpEntityMethodProcessor - Using 'application/json', given [*/*] and supported [application/json, application/*+json]
- 16:02:57.518 [main] DEBUG org.springframework.web.servlet.mvc.method.annotation.HttpEntityMethodProcessor - Writing [{msg=操作成功, code=200, data=com.zksy.cockpit.geometry.CockpitFacilityGeometryResponse@2a0b901c}]
- 16:02:57.526 [main] DEBUG org.springframework.test.web.servlet.TestDispatcherServlet - Completed 200 OK
- 16:02:57.527 [main] DEBUG com.jayway.jsonpath.internal.path.CompiledPath - Evaluating path: $['data']['features'][0]['type']
- 16:02:57.527 [main] DEBUG com.jayway.jsonpath.internal.path.CompiledPath - Evaluating path: $['data']['features'][0]['geometry']
- 16:02:57.527 [main] DEBUG com.jayway.jsonpath.internal.path.CompiledPath - Evaluating path: $['data']['features'][0]['properties']['networkId']
- 16:02:57.527 [main] DEBUG com.jayway.jsonpath.internal.path.CompiledPath - Evaluating path: $['data']['features'][0]['properties']['pointType']
- 16:02:57.528 [main] DEBUG com.jayway.jsonpath.internal.path.CompiledPath - Evaluating path: $['data']['features'][0]['properties']['sourceCoordinates'][0][0]
- 16:02:57.528 [main] DEBUG com.jayway.jsonpath.internal.path.CompiledPath - Evaluating path: $['data']['features'][0]['properties']['coordinateValidation']['state']
- 16:02:57.528 [main] DEBUG com.jayway.jsonpath.internal.path.CompiledPath - Evaluating path: $['data']['features'][0]['properties']['coordinateValidation']['reason']
- 16:02:57.528 [main] DEBUG com.jayway.jsonpath.internal.path.CompiledPath - Evaluating path: $['data']['features'][0]['properties']['coordinateValidation']['renderable']
- 16:02:57.528 [main] DEBUG com.jayway.jsonpath.internal.path.CompiledPath - Evaluating path: $['data']['features'][0]['properties']['coordinateValidation']['crs']
- 16:02:57.530 [main] DEBUG org.hibernate.validator.messageinterpolation.ResourceBundleMessageInterpolator - Loaded expression factory via original TCCL
- 16:02:57.530 [main] DEBUG org.hibernate.validator.internal.engine.AbstractConfigurationImpl - Setting custom MessageInterpolator of type org.springframework.validation.beanvalidation.LocaleContextMessageInterpolator
- 16:02:57.530 [main] DEBUG org.hibernate.validator.internal.engine.AbstractConfigurationImpl - Setting custom ParameterNameProvider of type org.springframework.validation.beanvalidation.LocalValidatorFactoryBean$1
- 16:02:57.530 [main] DEBUG org.hibernate.validator.internal.xml.config.ValidationXmlParser - Trying to load META-INF/validation.xml for XML based Validator configuration.
- 16:02:57.530 [main] DEBUG org.hibernate.validator.internal.xml.config.ResourceLoaderHelper - Trying to load META-INF/validation.xml via TCCL
- 16:02:57.531 [main] DEBUG org.hibernate.validator.internal.xml.config.ResourceLoaderHelper - Trying to load META-INF/validation.xml via Hibernate Validator's class loader
- 16:02:57.531 [main] DEBUG org.hibernate.validator.internal.xml.config.ValidationXmlParser - No META-INF/validation.xml found. Using annotation based configuration only.
- 16:02:57.531 [main] DEBUG org.hibernate.validator.internal.engine.resolver.TraversableResolvers - Cannot find javax.persistence.Persistence on classpath. Assuming non JPA 2 environment. All properties will per default be traversable.
- 16:02:57.532 [main] DEBUG org.hibernate.validator.internal.engine.ValidatorFactoryConfigurationHelper - HV000252: Using org.hibernate.validator.internal.engine.DefaultPropertyNodeNameProvider as property node name provider.
- 16:02:57.532 [main] DEBUG org.hibernate.validator.internal.engine.ValidatorFactoryConfigurationHelper - HV000234: Using org.springframework.validation.beanvalidation.LocaleContextMessageInterpolator as ValidatorFactory-scoped message interpolator.
- 16:02:57.532 [main] DEBUG org.hibernate.validator.internal.engine.ValidatorFactoryConfigurationHelper - HV000234: Using org.hibernate.validator.internal.engine.resolver.TraverseAllTraversableResolver as ValidatorFactory-scoped traversable resolver.
- 16:02:57.533 [main] DEBUG org.hibernate.validator.internal.engine.ValidatorFactoryConfigurationHelper - HV000234: Using org.hibernate.validator.internal.util.ExecutableParameterNameProvider as ValidatorFactory-scoped parameter name provider.
- 16:02:57.533 [main] DEBUG org.hibernate.validator.internal.engine.ValidatorFactoryConfigurationHelper - HV000234: Using org.hibernate.validator.internal.engine.DefaultClockProvider as ValidatorFactory-scoped clock provider.
- 16:02:57.533 [main] DEBUG org.hibernate.validator.internal.engine.ValidatorFactoryConfigurationHelper - HV000234: Using org.hibernate.validator.internal.engine.scripting.DefaultScriptEvaluatorFactory as ValidatorFactory-scoped script evaluator factory.
- 16:02:57.534 [main] DEBUG _org.springframework.web.servlet.HandlerMapping.Mappings -
- c.z.w.c.c.CockpitFacilityGeometryController:
- {GET [/api/cockpit/v1/infrastructure/geometry]}: geometry()
- 16:02:57.534 [main] DEBUG org.springframework.web.servlet.mvc.method.annotation.RequestMappingHandlerMapping - 1 mappings in org.springframework.web.servlet.mvc.method.annotation.RequestMappingHandlerMapping
- 16:02:57.538 [main] DEBUG org.springframework.web.servlet.mvc.method.annotation.RequestMappingHandlerAdapter - ControllerAdvice beans: 0 @ModelAttribute, 0 @InitBinder, 1 RequestBodyAdvice, 1 ResponseBodyAdvice
- 16:02:57.539 [main] DEBUG org.springframework.web.servlet.mvc.method.annotation.ExceptionHandlerExceptionResolver - ControllerAdvice beans: 0 @ExceptionHandler, 1 ResponseBodyAdvice
- 16:02:57.539 [main] INFO org.springframework.mock.web.MockServletContext - Initializing Spring TestDispatcherServlet ''
- 16:02:57.539 [main] INFO org.springframework.test.web.servlet.TestDispatcherServlet - Initializing Servlet ''
- 16:02:57.539 [main] DEBUG org.springframework.test.web.servlet.TestDispatcherServlet - Detected AcceptHeaderLocaleResolver
- 16:02:57.539 [main] DEBUG org.springframework.test.web.servlet.TestDispatcherServlet - Detected FixedThemeResolver
- 16:02:57.539 [main] DEBUG org.springframework.test.web.servlet.TestDispatcherServlet - Detected org.springframework.web.servlet.view.DefaultRequestToViewNameTranslator@2dbfa972
- 16:02:57.540 [main] DEBUG org.springframework.test.web.servlet.TestDispatcherServlet - Detected org.springframework.web.servlet.support.SessionFlashMapManager@46f73ffa
- 16:02:57.540 [main] DEBUG org.springframework.test.web.servlet.TestDispatcherServlet - enableLoggingRequestDetails='false': request parameters and headers will be masked to prevent unsafe logging of potentially sensitive data
- 16:02:57.540 [main] INFO org.springframework.test.web.servlet.TestDispatcherServlet - Completed initialization in 1 ms
- 16:02:57.540 [main] DEBUG org.springframework.test.web.servlet.TestDispatcherServlet - POST "/api/cockpit/v1/infrastructure/geometry", parameters={}
- 16:02:57.541 [main] WARN org.springframework.web.servlet.mvc.support.DefaultHandlerExceptionResolver - Resolved [org.springframework.web.HttpRequestMethodNotSupportedException: Request method 'POST' not supported]
- 16:02:57.541 [main] DEBUG org.springframework.test.web.servlet.TestDispatcherServlet - Completed 405 METHOD_NOT_ALLOWED
- 16:02:57.544 [main] DEBUG org.hibernate.validator.messageinterpolation.ResourceBundleMessageInterpolator - Loaded expression factory via original TCCL
- 16:02:57.544 [main] DEBUG org.hibernate.validator.internal.engine.AbstractConfigurationImpl - Setting custom MessageInterpolator of type org.springframework.validation.beanvalidation.LocaleContextMessageInterpolator
- 16:02:57.544 [main] DEBUG org.hibernate.validator.internal.engine.AbstractConfigurationImpl - Setting custom ParameterNameProvider of type org.springframework.validation.beanvalidation.LocalValidatorFactoryBean$1
- 16:02:57.544 [main] DEBUG org.hibernate.validator.internal.xml.config.ValidationXmlParser - Trying to load META-INF/validation.xml for XML based Validator configuration.
- 16:02:57.544 [main] DEBUG org.hibernate.validator.internal.xml.config.ResourceLoaderHelper - Trying to load META-INF/validation.xml via TCCL
- 16:02:57.545 [main] DEBUG org.hibernate.validator.internal.xml.config.ResourceLoaderHelper - Trying to load META-INF/validation.xml via Hibernate Validator's class loader
- 16:02:57.545 [main] DEBUG org.hibernate.validator.internal.xml.config.ValidationXmlParser - No META-INF/validation.xml found. Using annotation based configuration only.
- 16:02:57.545 [main] DEBUG org.hibernate.validator.internal.engine.resolver.TraversableResolvers - Cannot find javax.persistence.Persistence on classpath. Assuming non JPA 2 environment. All properties will per default be traversable.
- 16:02:57.546 [main] DEBUG org.hibernate.validator.internal.engine.ValidatorFactoryConfigurationHelper - HV000252: Using org.hibernate.validator.internal.engine.DefaultPropertyNodeNameProvider as property node name provider.
- 16:02:57.547 [main] DEBUG org.hibernate.validator.internal.engine.ValidatorFactoryConfigurationHelper - HV000234: Using org.springframework.validation.beanvalidation.LocaleContextMessageInterpolator as ValidatorFactory-scoped message interpolator.
- 16:02:57.547 [main] DEBUG org.hibernate.validator.internal.engine.ValidatorFactoryConfigurationHelper - HV000234: Using org.hibernate.validator.internal.engine.resolver.TraverseAllTraversableResolver as ValidatorFactory-scoped traversable resolver.
- 16:02:57.547 [main] DEBUG org.hibernate.validator.internal.engine.ValidatorFactoryConfigurationHelper - HV000234: Using org.hibernate.validator.internal.util.ExecutableParameterNameProvider as ValidatorFactory-scoped parameter name provider.
- 16:02:57.547 [main] DEBUG org.hibernate.validator.internal.engine.ValidatorFactoryConfigurationHelper - HV000234: Using org.hibernate.validator.internal.engine.DefaultClockProvider as ValidatorFactory-scoped clock provider.
- 16:02:57.547 [main] DEBUG org.hibernate.validator.internal.engine.ValidatorFactoryConfigurationHelper - HV000234: Using org.hibernate.validator.internal.engine.scripting.DefaultScriptEvaluatorFactory as ValidatorFactory-scoped script evaluator factory.
- 16:02:57.548 [main] DEBUG _org.springframework.web.servlet.HandlerMapping.Mappings -
- c.z.w.c.c.CockpitFacilityGeometryController:
- {GET [/api/cockpit/v1/infrastructure/geometry]}: geometry()
- 16:02:57.548 [main] DEBUG org.springframework.web.servlet.mvc.method.annotation.RequestMappingHandlerMapping - 1 mappings in org.springframework.web.servlet.mvc.method.annotation.RequestMappingHandlerMapping
- 16:02:57.550 [main] DEBUG org.springframework.web.servlet.mvc.method.annotation.RequestMappingHandlerAdapter - ControllerAdvice beans: 0 @ModelAttribute, 0 @InitBinder, 1 RequestBodyAdvice, 1 ResponseBodyAdvice
- 16:02:57.552 [main] DEBUG org.springframework.web.servlet.mvc.method.annotation.ExceptionHandlerExceptionResolver - ControllerAdvice beans: 0 @ExceptionHandler, 1 ResponseBodyAdvice
- 16:02:57.552 [main] INFO org.springframework.mock.web.MockServletContext - Initializing Spring TestDispatcherServlet ''
- 16:02:57.552 [main] INFO org.springframework.test.web.servlet.TestDispatcherServlet - Initializing Servlet ''
- 16:02:57.552 [main] DEBUG org.springframework.test.web.servlet.TestDispatcherServlet - Detected AcceptHeaderLocaleResolver
- 16:02:57.552 [main] DEBUG org.springframework.test.web.servlet.TestDispatcherServlet - Detected FixedThemeResolver
- 16:02:57.552 [main] DEBUG org.springframework.test.web.servlet.TestDispatcherServlet - Detected org.springframework.web.servlet.view.DefaultRequestToViewNameTranslator@350323a0
- 16:02:57.552 [main] DEBUG org.springframework.test.web.servlet.TestDispatcherServlet - Detected org.springframework.web.servlet.support.SessionFlashMapManager@2506b881
- 16:02:57.552 [main] DEBUG org.springframework.test.web.servlet.TestDispatcherServlet - enableLoggingRequestDetails='false': request parameters and headers will be masked to prevent unsafe logging of potentially sensitive data
- 16:02:57.552 [main] INFO org.springframework.test.web.servlet.TestDispatcherServlet - Completed initialization in 0 ms
- 16:02:57.554 [main] DEBUG org.hibernate.validator.messageinterpolation.ResourceBundleMessageInterpolator - Loaded expression factory via original TCCL
- 16:02:57.554 [main] DEBUG org.hibernate.validator.internal.engine.AbstractConfigurationImpl - Setting custom MessageInterpolator of type org.springframework.validation.beanvalidation.LocaleContextMessageInterpolator
- 16:02:57.554 [main] DEBUG org.hibernate.validator.internal.engine.AbstractConfigurationImpl - Setting custom ParameterNameProvider of type org.springframework.validation.beanvalidation.LocalValidatorFactoryBean$1
- 16:02:57.555 [main] DEBUG org.hibernate.validator.internal.xml.config.ValidationXmlParser - Trying to load META-INF/validation.xml for XML based Validator configuration.
- 16:02:57.555 [main] DEBUG org.hibernate.validator.internal.xml.config.ResourceLoaderHelper - Trying to load META-INF/validation.xml via TCCL
- 16:02:57.556 [main] DEBUG org.hibernate.validator.internal.xml.config.ResourceLoaderHelper - Trying to load META-INF/validation.xml via Hibernate Validator's class loader
- 16:02:57.556 [main] DEBUG org.hibernate.validator.internal.xml.config.ValidationXmlParser - No META-INF/validation.xml found. Using annotation based configuration only.
- 16:02:57.557 [main] DEBUG org.hibernate.validator.internal.engine.resolver.TraversableResolvers - Cannot find javax.persistence.Persistence on classpath. Assuming non JPA 2 environment. All properties will per default be traversable.
- 16:02:57.557 [main] DEBUG org.hibernate.validator.internal.engine.ValidatorFactoryConfigurationHelper - HV000252: Using org.hibernate.validator.internal.engine.DefaultPropertyNodeNameProvider as property node name provider.
- 16:02:57.557 [main] DEBUG org.hibernate.validator.internal.engine.ValidatorFactoryConfigurationHelper - HV000234: Using org.springframework.validation.beanvalidation.LocaleContextMessageInterpolator as ValidatorFactory-scoped message interpolator.
- 16:02:57.557 [main] DEBUG org.hibernate.validator.internal.engine.ValidatorFactoryConfigurationHelper - HV000234: Using org.hibernate.validator.internal.engine.resolver.TraverseAllTraversableResolver as ValidatorFactory-scoped traversable resolver.
- 16:02:57.557 [main] DEBUG org.hibernate.validator.internal.engine.ValidatorFactoryConfigurationHelper - HV000234: Using org.hibernate.validator.internal.util.ExecutableParameterNameProvider as ValidatorFactory-scoped parameter name provider.
- 16:02:57.557 [main] DEBUG org.hibernate.validator.internal.engine.ValidatorFactoryConfigurationHelper - HV000234: Using org.hibernate.validator.internal.engine.DefaultClockProvider as ValidatorFactory-scoped clock provider.
- 16:02:57.557 [main] DEBUG org.hibernate.validator.internal.engine.ValidatorFactoryConfigurationHelper - HV000234: Using org.hibernate.validator.internal.engine.scripting.DefaultScriptEvaluatorFactory as ValidatorFactory-scoped script evaluator factory.
- 16:02:57.558 [main] DEBUG _org.springframework.web.servlet.HandlerMapping.Mappings -
- c.z.w.c.c.CockpitFacilityGeometryController:
- {GET [/api/cockpit/v1/infrastructure/geometry]}: geometry()
- 16:02:57.559 [main] DEBUG org.springframework.web.servlet.mvc.method.annotation.RequestMappingHandlerMapping - 1 mappings in org.springframework.web.servlet.mvc.method.annotation.RequestMappingHandlerMapping
- 16:02:57.562 [main] DEBUG org.springframework.web.servlet.mvc.method.annotation.RequestMappingHandlerAdapter - ControllerAdvice beans: 0 @ModelAttribute, 0 @InitBinder, 1 RequestBodyAdvice, 1 ResponseBodyAdvice
- 16:02:57.563 [main] DEBUG org.springframework.web.servlet.mvc.method.annotation.ExceptionHandlerExceptionResolver - ControllerAdvice beans: 0 @ExceptionHandler, 1 ResponseBodyAdvice
- 16:02:57.563 [main] INFO org.springframework.mock.web.MockServletContext - Initializing Spring TestDispatcherServlet ''
- 16:02:57.563 [main] INFO org.springframework.test.web.servlet.TestDispatcherServlet - Initializing Servlet ''
- 16:02:57.563 [main] DEBUG org.springframework.test.web.servlet.TestDispatcherServlet - Detected AcceptHeaderLocaleResolver
- 16:02:57.563 [main] DEBUG org.springframework.test.web.servlet.TestDispatcherServlet - Detected FixedThemeResolver
- 16:02:57.563 [main] DEBUG org.springframework.test.web.servlet.TestDispatcherServlet - Detected org.springframework.web.servlet.view.DefaultRequestToViewNameTranslator@2eb0cefe
- 16:02:57.563 [main] DEBUG org.springframework.test.web.servlet.TestDispatcherServlet - Detected org.springframework.web.servlet.support.SessionFlashMapManager@5a2ae1ab
- 16:02:57.563 [main] DEBUG org.springframework.test.web.servlet.TestDispatcherServlet - enableLoggingRequestDetails='false': request parameters and headers will be masked to prevent unsafe logging of potentially sensitive data
- 16:02:57.563 [main] INFO org.springframework.test.web.servlet.TestDispatcherServlet - Completed initialization in 0 ms
- 16:02:57.563 [main] DEBUG org.springframework.test.web.servlet.TestDispatcherServlet - GET "/api/cockpit/v1/infrastructure/geometry", parameters={}
- 16:02:57.563 [main] DEBUG org.springframework.web.servlet.mvc.method.annotation.RequestMappingHandlerMapping - Mapped to com.zksy.web.controller.cockpit.CockpitFacilityGeometryController#geometry()
- 16:02:57.568 [main] DEBUG org.springframework.web.servlet.mvc.method.annotation.HttpEntityMethodProcessor - Using 'application/json', given [*/*] and supported [application/json, application/*+json]
- 16:02:57.568 [main] DEBUG org.springframework.web.servlet.mvc.method.annotation.HttpEntityMethodProcessor - Writing [{msg=操作成功, code=200, data=com.zksy.cockpit.geometry.CockpitFacilityGeometryResponse@1c5d3a37}]
- 16:02:57.575 [main] DEBUG org.springframework.test.web.servlet.TestDispatcherServlet - Completed 200 OK
- 16:02:57.576 [main] DEBUG com.jayway.jsonpath.internal.path.CompiledPath - Evaluating path: $['data']['features']
- 16:02:57.576 [main] DEBUG com.jayway.jsonpath.internal.path.CompiledPath - Evaluating path: $['data']['features'][0]['geometry']['type']
- 16:02:57.576 [main] DEBUG com.jayway.jsonpath.internal.path.CompiledPath - Evaluating path: $['data']['features'][0]['properties']['diameter']
- 16:02:57.577 [main] DEBUG com.jayway.jsonpath.internal.path.CompiledPath - Evaluating path: $['data']['features'][1]['properties']['diameter']
- 16:02:57.577 [main] DEBUG com.jayway.jsonpath.internal.path.CompiledPath - Evaluating path: $['data']['features'][0]['geometry']['coordinates']
- 16:02:57.578 [main] DEBUG com.jayway.jsonpath.internal.path.CompiledPath - Evaluating path: $['data']['features'][0]['geometry']['coordinates'][0][0]
- 16:02:57.578 [main] DEBUG com.jayway.jsonpath.internal.path.CompiledPath - Evaluating path: $['data']['features'][0]['geometry']['coordinates'][0][1]
- 16:02:57.579 [main] DEBUG com.jayway.jsonpath.internal.path.CompiledPath - Evaluating path: $['data']['features'][0]['geometry']['coordinates'][1][0]
- 16:02:57.579 [main] DEBUG com.jayway.jsonpath.internal.path.CompiledPath - Evaluating path: $['data']['features'][0]['geometry']['coordinates'][1][1]
- 16:02:57.580 [main] DEBUG com.jayway.jsonpath.internal.path.CompiledPath - Evaluating path: $['data']['features'][1]['geometry']['type']
- 16:02:57.580 [main] DEBUG com.jayway.jsonpath.internal.path.CompiledPath - Evaluating path: $['data']['features'][1]['geometry']['coordinates']
- 16:02:57.580 [main] DEBUG com.jayway.jsonpath.internal.path.CompiledPath - Evaluating path: $['data']['features'][1]['geometry']['coordinates'][0]
- 16:02:57.581 [main] DEBUG com.jayway.jsonpath.internal.path.CompiledPath - Evaluating path: $['data']['features'][1]['geometry']['coordinates'][1]
- 16:02:57.581 [main] DEBUG com.jayway.jsonpath.internal.path.CompiledPath - Evaluating path: $['data']['features'][1]['properties']['pointType']
- 16:02:57.581 [main] DEBUG com.jayway.jsonpath.internal.path.CompiledPath - Evaluating path: $['data']['features'][1]['properties']['networkId']
- 16:02:57.582 [main] DEBUG com.jayway.jsonpath.internal.path.CompiledPath - Evaluating path: $['data']['features'][1]['properties']['coordinateValidation']['state']
- 16:02:57.582 [main] DEBUG com.jayway.jsonpath.internal.path.CompiledPath - Evaluating path: $['data']['features'][1]['properties']['coordinateValidation']['renderable']
- 16:02:57.583 [main] DEBUG org.hibernate.validator.messageinterpolation.ResourceBundleMessageInterpolator - Loaded expression factory via original TCCL
- 16:02:57.583 [main] DEBUG org.hibernate.validator.internal.engine.AbstractConfigurationImpl - Setting custom MessageInterpolator of type org.springframework.validation.beanvalidation.LocaleContextMessageInterpolator
- 16:02:57.583 [main] DEBUG org.hibernate.validator.internal.engine.AbstractConfigurationImpl - Setting custom ParameterNameProvider of type org.springframework.validation.beanvalidation.LocalValidatorFactoryBean$1
- 16:02:57.584 [main] DEBUG org.hibernate.validator.internal.xml.config.ValidationXmlParser - Trying to load META-INF/validation.xml for XML based Validator configuration.
- 16:02:57.584 [main] DEBUG org.hibernate.validator.internal.xml.config.ResourceLoaderHelper - Trying to load META-INF/validation.xml via TCCL
- 16:02:57.584 [main] DEBUG org.hibernate.validator.internal.xml.config.ResourceLoaderHelper - Trying to load META-INF/validation.xml via Hibernate Validator's class loader
- 16:02:57.584 [main] DEBUG org.hibernate.validator.internal.xml.config.ValidationXmlParser - No META-INF/validation.xml found. Using annotation based configuration only.
- 16:02:57.585 [main] DEBUG org.hibernate.validator.internal.engine.resolver.TraversableResolvers - Cannot find javax.persistence.Persistence on classpath. Assuming non JPA 2 environment. All properties will per default be traversable.
- 16:02:57.586 [main] DEBUG org.hibernate.validator.internal.engine.ValidatorFactoryConfigurationHelper - HV000252: Using org.hibernate.validator.internal.engine.DefaultPropertyNodeNameProvider as property node name provider.
- 16:02:57.586 [main] DEBUG org.hibernate.validator.internal.engine.ValidatorFactoryConfigurationHelper - HV000234: Using org.springframework.validation.beanvalidation.LocaleContextMessageInterpolator as ValidatorFactory-scoped message interpolator.
- 16:02:57.586 [main] DEBUG org.hibernate.validator.internal.engine.ValidatorFactoryConfigurationHelper - HV000234: Using org.hibernate.validator.internal.engine.resolver.TraverseAllTraversableResolver as ValidatorFactory-scoped traversable resolver.
- 16:02:57.586 [main] DEBUG org.hibernate.validator.internal.engine.ValidatorFactoryConfigurationHelper - HV000234: Using org.hibernate.validator.internal.util.ExecutableParameterNameProvider as ValidatorFactory-scoped parameter name provider.
- 16:02:57.586 [main] DEBUG org.hibernate.validator.internal.engine.ValidatorFactoryConfigurationHelper - HV000234: Using org.hibernate.validator.internal.engine.DefaultClockProvider as ValidatorFactory-scoped clock provider.
- 16:02:57.586 [main] DEBUG org.hibernate.validator.internal.engine.ValidatorFactoryConfigurationHelper - HV000234: Using org.hibernate.validator.internal.engine.scripting.DefaultScriptEvaluatorFactory as ValidatorFactory-scoped script evaluator factory.
- 16:02:57.588 [main] DEBUG _org.springframework.web.servlet.HandlerMapping.Mappings -
- c.z.w.c.c.CockpitFacilityGeometryController:
- {GET [/api/cockpit/v1/infrastructure/geometry]}: geometry()
- 16:02:57.588 [main] DEBUG org.springframework.web.servlet.mvc.method.annotation.RequestMappingHandlerMapping - 1 mappings in org.springframework.web.servlet.mvc.method.annotation.RequestMappingHandlerMapping
- 16:02:57.592 [main] DEBUG org.springframework.web.servlet.mvc.method.annotation.RequestMappingHandlerAdapter - ControllerAdvice beans: 0 @ModelAttribute, 0 @InitBinder, 1 RequestBodyAdvice, 1 ResponseBodyAdvice
- 16:02:57.593 [main] DEBUG org.springframework.web.servlet.mvc.method.annotation.ExceptionHandlerExceptionResolver - ControllerAdvice beans: 0 @ExceptionHandler, 1 ResponseBodyAdvice
- 16:02:57.594 [main] INFO org.springframework.mock.web.MockServletContext - Initializing Spring TestDispatcherServlet ''
- 16:02:57.594 [main] INFO org.springframework.test.web.servlet.TestDispatcherServlet - Initializing Servlet ''
- 16:02:57.594 [main] DEBUG org.springframework.test.web.servlet.TestDispatcherServlet - Detected AcceptHeaderLocaleResolver
- 16:02:57.594 [main] DEBUG org.springframework.test.web.servlet.TestDispatcherServlet - Detected FixedThemeResolver
- 16:02:57.594 [main] DEBUG org.springframework.test.web.servlet.TestDispatcherServlet - Detected org.springframework.web.servlet.view.DefaultRequestToViewNameTranslator@62f9c790
- 16:02:57.594 [main] DEBUG org.springframework.test.web.servlet.TestDispatcherServlet - Detected org.springframework.web.servlet.support.SessionFlashMapManager@21e5f0b6
- 16:02:57.594 [main] DEBUG org.springframework.test.web.servlet.TestDispatcherServlet - enableLoggingRequestDetails='false': request parameters and headers will be masked to prevent unsafe logging of potentially sensitive data
- 16:02:57.594 [main] INFO org.springframework.test.web.servlet.TestDispatcherServlet - Completed initialization in 0 ms
- 16:02:57.596 [main] DEBUG org.springframework.test.web.servlet.TestDispatcherServlet - GET "/api/cockpit/v1/infrastructure/geometry", parameters={}
- 16:02:57.596 [main] DEBUG org.springframework.web.servlet.mvc.method.annotation.RequestMappingHandlerMapping - Mapped to com.zksy.web.controller.cockpit.CockpitFacilityGeometryController#geometry()
- 16:02:57.597 [main] DEBUG org.springframework.web.servlet.mvc.method.annotation.ExceptionHandlerExceptionResolver - Using @ExceptionHandler com.zksy.web.controller.cockpit.CockpitFacilityGeometryController#handleReadFailure(HttpServletRequest, RuntimeException)
- 16:02:57.599 [main] ERROR com.zksy.web.controller.cockpit.CockpitFacilityGeometryController - Facility geometry read failed
- org.springframework.transaction.CannotCreateTransactionException: private connection detail
- at com.zksy.web.controller.cockpit.CockpitFacilityGeometryController.geometry(CockpitFacilityGeometryController.java:31)
- at java.base/jdk.internal.reflect.NativeMethodAccessorImpl.invoke0(Native Method)
- at java.base/jdk.internal.reflect.NativeMethodAccessorImpl.invoke(NativeMethodAccessorImpl.java:77)
- at java.base/jdk.internal.reflect.DelegatingMethodAccessorImpl.invoke(DelegatingMethodAccessorImpl.java:43)
- at java.base/java.lang.reflect.Method.invoke(Method.java:568)
- at org.springframework.web.method.support.InvocableHandlerMethod.doInvoke(InvocableHandlerMethod.java:205)
- at org.springframework.web.method.support.InvocableHandlerMethod.invokeForRequest(InvocableHandlerMethod.java:150)
- at org.springframework.web.servlet.mvc.method.annotation.ServletInvocableHandlerMethod.invokeAndHandle(ServletInvocableHandlerMethod.java:117)
- at org.springframework.web.servlet.mvc.method.annotation.RequestMappingHandlerAdapter.invokeHandlerMethod(RequestMappingHandlerAdapter.java:903)
- at org.springframework.web.servlet.mvc.method.annotation.RequestMappingHandlerAdapter.handleInternal(RequestMappingHandlerAdapter.java:809)
- at org.springframework.web.servlet.mvc.method.AbstractHandlerMethodAdapter.handle(AbstractHandlerMethodAdapter.java:87)
- at org.springframework.web.servlet.DispatcherServlet.doDispatch(DispatcherServlet.java:1072)
- at org.springframework.web.servlet.DispatcherServlet.doService(DispatcherServlet.java:965)
- at org.springframework.web.servlet.FrameworkServlet.processRequest(FrameworkServlet.java:1006)
- at org.springframework.web.servlet.FrameworkServlet.doGet(FrameworkServlet.java:898)
- at javax.servlet.http.HttpServlet.service(HttpServlet.java:529)
- at org.springframework.web.servlet.FrameworkServlet.service(FrameworkServlet.java:883)
- at org.springframework.test.web.servlet.TestDispatcherServlet.service(TestDispatcherServlet.java:72)
- at javax.servlet.http.HttpServlet.service(HttpServlet.java:623)
- at org.springframework.mock.web.MockFilterChain$ServletFilterProxy.doFilter(MockFilterChain.java:167)
- at org.springframework.mock.web.MockFilterChain.doFilter(MockFilterChain.java:134)
- at org.springframework.test.web.servlet.MockMvc.perform(MockMvc.java:201)
- at com.zksy.web.controller.cockpit.CockpitFacilityGeometryControllerTest.transactionProxyFailureIsAlsoMappedToSanitized500(CockpitFacilityGeometryControllerTest.java:148)
- at java.base/jdk.internal.reflect.NativeMethodAccessorImpl.invoke0(Native Method)
- at java.base/jdk.internal.reflect.NativeMethodAccessorImpl.invoke(NativeMethodAccessorImpl.java:77)
- at java.base/jdk.internal.reflect.DelegatingMethodAccessorImpl.invoke(DelegatingMethodAccessorImpl.java:43)
- at java.base/java.lang.reflect.Method.invoke(Method.java:568)
- at org.junit.platform.commons.util.ReflectionUtils.invokeMethod(ReflectionUtils.java:688)
- at org.junit.jupiter.engine.execution.MethodInvocation.proceed(MethodInvocation.java:60)
- at org.junit.jupiter.engine.execution.InvocationInterceptorChain$ValidatingInvocation.proceed(InvocationInterceptorChain.java:131)
- at org.junit.jupiter.engine.extension.TimeoutExtension.intercept(TimeoutExtension.java:149)
- at org.junit.jupiter.engine.extension.TimeoutExtension.interceptTestableMethod(TimeoutExtension.java:140)
- at org.junit.jupiter.engine.extension.TimeoutExtension.interceptTestMethod(TimeoutExtension.java:84)
- at org.junit.jupiter.engine.execution.ExecutableInvoker$ReflectiveInterceptorCall.lambda$ofVoidMethod$0(ExecutableInvoker.java:115)
- at org.junit.jupiter.engine.execution.ExecutableInvoker.lambda$invoke$0(ExecutableInvoker.java:105)
- at org.junit.jupiter.engine.execution.InvocationInterceptorChain$InterceptedInvocation.proceed(InvocationInterceptorChain.java:106)
- at org.junit.jupiter.engine.execution.InvocationInterceptorChain.proceed(InvocationInterceptorChain.java:64)
- at org.junit.jupiter.engine.execution.InvocationInterceptorChain.chainAndInvoke(InvocationInterceptorChain.java:45)
- at org.junit.jupiter.engine.execution.InvocationInterceptorChain.invoke(InvocationInterceptorChain.java:37)
- at org.junit.jupiter.engine.execution.ExecutableInvoker.invoke(ExecutableInvoker.java:104)
- at org.junit.jupiter.engine.execution.ExecutableInvoker.invoke(ExecutableInvoker.java:98)
- at org.junit.jupiter.engine.descriptor.TestMethodTestDescriptor.lambda$invokeTestMethod$6(TestMethodTestDescriptor.java:210)
- at org.junit.platform.engine.support.hierarchical.ThrowableCollector.execute(ThrowableCollector.java:73)
- at org.junit.jupiter.engine.descriptor.TestMethodTestDescriptor.invokeTestMethod(TestMethodTestDescriptor.java:206)
- at org.junit.jupiter.engine.descriptor.TestMethodTestDescriptor.execute(TestMethodTestDescriptor.java:131)
- at org.junit.jupiter.engine.descriptor.TestMethodTestDescriptor.execute(TestMethodTestDescriptor.java:65)
- at org.junit.platform.engine.support.hierarchical.NodeTestTask.lambda$executeRecursively$5(NodeTestTask.java:139)
- at org.junit.platform.engine.support.hierarchical.ThrowableCollector.execute(ThrowableCollector.java:73)
- at org.junit.platform.engine.support.hierarchical.NodeTestTask.lambda$executeRecursively$7(NodeTestTask.java:129)
- at org.junit.platform.engine.support.hierarchical.Node.around(Node.java:137)
- at org.junit.platform.engine.support.hierarchical.NodeTestTask.lambda$executeRecursively$8(NodeTestTask.java:127)
- at org.junit.platform.engine.support.hierarchical.ThrowableCollector.execute(ThrowableCollector.java:73)
- at org.junit.platform.engine.support.hierarchical.NodeTestTask.executeRecursively(NodeTestTask.java:126)
- at org.junit.platform.engine.support.hierarchical.NodeTestTask.execute(NodeTestTask.java:84)
- at java.base/java.util.ArrayList.forEach(ArrayList.java:1511)
- at org.junit.platform.engine.support.hierarchical.SameThreadHierarchicalTestExecutorService.invokeAll(SameThreadHierarchicalTestExecutorService.java:38)
- at org.junit.platform.engine.support.hierarchical.NodeTestTask.lambda$executeRecursively$5(NodeTestTask.java:143)
- at org.junit.platform.engine.support.hierarchical.ThrowableCollector.execute(ThrowableCollector.java:73)
- at org.junit.platform.engine.support.hierarchical.NodeTestTask.lambda$executeRecursively$7(NodeTestTask.java:129)
- at org.junit.platform.engine.support.hierarchical.Node.around(Node.java:137)
- at org.junit.platform.engine.support.hierarchical.NodeTestTask.lambda$executeRecursively$8(NodeTestTask.java:127)
- at org.junit.platform.engine.support.hierarchical.ThrowableCollector.execute(ThrowableCollector.java:73)
- at org.junit.platform.engine.support.hierarchical.NodeTestTask.executeRecursively(NodeTestTask.java:126)
- at org.junit.platform.engine.support.hierarchical.NodeTestTask.execute(NodeTestTask.java:84)
- at java.base/java.util.ArrayList.forEach(ArrayList.java:1511)
- at org.junit.platform.engine.support.hierarchical.SameThreadHierarchicalTestExecutorService.invokeAll(SameThreadHierarchicalTestExecutorService.java:38)
- at org.junit.platform.engine.support.hierarchical.NodeTestTask.lambda$executeRecursively$5(NodeTestTask.java:143)
- at org.junit.platform.engine.support.hierarchical.ThrowableCollector.execute(ThrowableCollector.java:73)
- at org.junit.platform.engine.support.hierarchical.NodeTestTask.lambda$executeRecursively$7(NodeTestTask.java:129)
- at org.junit.platform.engine.support.hierarchical.Node.around(Node.java:137)
- at org.junit.platform.engine.support.hierarchical.NodeTestTask.lambda$executeRecursively$8(NodeTestTask.java:127)
- at org.junit.platform.engine.support.hierarchical.ThrowableCollector.execute(ThrowableCollector.java:73)
- at org.junit.platform.engine.support.hierarchical.NodeTestTask.executeRecursively(NodeTestTask.java:126)
- at org.junit.platform.engine.support.hierarchical.NodeTestTask.execute(NodeTestTask.java:84)
- at org.junit.platform.engine.support.hierarchical.SameThreadHierarchicalTestExecutorService.submit(SameThreadHierarchicalTestExecutorService.java:32)
- at org.junit.platform.engine.support.hierarchical.HierarchicalTestExecutor.execute(HierarchicalTestExecutor.java:57)
- at org.junit.platform.engine.support.hierarchical.HierarchicalTestEngine.execute(HierarchicalTestEngine.java:51)
- at org.junit.platform.launcher.core.DefaultLauncher.execute(DefaultLauncher.java:220)
- at org.junit.platform.launcher.core.DefaultLauncher.lambda$execute$6(DefaultLauncher.java:188)
- at org.junit.platform.launcher.core.DefaultLauncher.withInterceptedStreams(DefaultLauncher.java:202)
- at org.junit.platform.launcher.core.DefaultLauncher.execute(DefaultLauncher.java:181)
- at org.junit.platform.launcher.core.DefaultLauncher.execute(DefaultLauncher.java:128)
- at org.apache.maven.surefire.junitplatform.JUnitPlatformProvider.invokeAllTests(JUnitPlatformProvider.java:150)
- at org.apache.maven.surefire.junitplatform.JUnitPlatformProvider.invoke(JUnitPlatformProvider.java:124)
- at org.apache.maven.surefire.booter.ForkedBooter.invokeProviderInSameClassLoader(ForkedBooter.java:384)
- at org.apache.maven.surefire.booter.ForkedBooter.runSuitesInProcess(ForkedBooter.java:345)
- at org.apache.maven.surefire.booter.ForkedBooter.execute(ForkedBooter.java:126)
- at org.apache.maven.surefire.booter.ForkedBooter.main(ForkedBooter.java:418)
- 16:02:57.605 [main] DEBUG org.springframework.web.servlet.mvc.method.annotation.HttpEntityMethodProcessor - Using 'application/json', given [*/*] and supported [application/json, application/*+json]
- 16:02:57.605 [main] DEBUG org.springframework.web.servlet.mvc.method.annotation.HttpEntityMethodProcessor - Writing [{msg=facility geometry source unavailable, code=500, data=com.zksy.cockpit.foundation.CockpitErrorPa (truncated)...]
- 16:02:57.607 [main] DEBUG org.springframework.web.servlet.mvc.method.annotation.ExceptionHandlerExceptionResolver - Resolved [org.springframework.transaction.CannotCreateTransactionException: private connection detail]
- 16:02:57.607 [main] DEBUG org.springframework.test.web.servlet.TestDispatcherServlet - Completed 500 INTERNAL_SERVER_ERROR
- 16:02:57.607 [main] DEBUG com.jayway.jsonpath.internal.path.CompiledPath - Evaluating path: $['code']
- 16:02:57.607 [main] DEBUG com.jayway.jsonpath.internal.path.CompiledPath - Evaluating path: $['data']['category']
- 16:02:57.607 [main] DEBUG com.jayway.jsonpath.internal.path.CompiledPath - Evaluating path: $['data']['message']
- 16:02:57.607 [main] DEBUG com.jayway.jsonpath.internal.path.CompiledPath - Evaluating path: $['data']['requestId']
- 16:02:57.609 [main] DEBUG org.hibernate.validator.messageinterpolation.ResourceBundleMessageInterpolator - Loaded expression factory via original TCCL
- 16:02:57.609 [main] DEBUG org.hibernate.validator.internal.engine.AbstractConfigurationImpl - Setting custom MessageInterpolator of type org.springframework.validation.beanvalidation.LocaleContextMessageInterpolator
- 16:02:57.609 [main] DEBUG org.hibernate.validator.internal.engine.AbstractConfigurationImpl - Setting custom ParameterNameProvider of type org.springframework.validation.beanvalidation.LocalValidatorFactoryBean$1
- 16:02:57.609 [main] DEBUG org.hibernate.validator.internal.xml.config.ValidationXmlParser - Trying to load META-INF/validation.xml for XML based Validator configuration.
- 16:02:57.609 [main] DEBUG org.hibernate.validator.internal.xml.config.ResourceLoaderHelper - Trying to load META-INF/validation.xml via TCCL
- 16:02:57.610 [main] DEBUG org.hibernate.validator.internal.xml.config.ResourceLoaderHelper - Trying to load META-INF/validation.xml via Hibernate Validator's class loader
- 16:02:57.610 [main] DEBUG org.hibernate.validator.internal.xml.config.ValidationXmlParser - No META-INF/validation.xml found. Using annotation based configuration only.
- 16:02:57.610 [main] DEBUG org.hibernate.validator.internal.engine.resolver.TraversableResolvers - Cannot find javax.persistence.Persistence on classpath. Assuming non JPA 2 environment. All properties will per default be traversable.
- 16:02:57.611 [main] DEBUG org.hibernate.validator.internal.engine.ValidatorFactoryConfigurationHelper - HV000252: Using org.hibernate.validator.internal.engine.DefaultPropertyNodeNameProvider as property node name provider.
- 16:02:57.611 [main] DEBUG org.hibernate.validator.internal.engine.ValidatorFactoryConfigurationHelper - HV000234: Using org.springframework.validation.beanvalidation.LocaleContextMessageInterpolator as ValidatorFactory-scoped message interpolator.
- 16:02:57.612 [main] DEBUG org.hibernate.validator.internal.engine.ValidatorFactoryConfigurationHelper - HV000234: Using org.hibernate.validator.internal.engine.resolver.TraverseAllTraversableResolver as ValidatorFactory-scoped traversable resolver.
- 16:02:57.612 [main] DEBUG org.hibernate.validator.internal.engine.ValidatorFactoryConfigurationHelper - HV000234: Using org.hibernate.validator.internal.util.ExecutableParameterNameProvider as ValidatorFactory-scoped parameter name provider.
- 16:02:57.612 [main] DEBUG org.hibernate.validator.internal.engine.ValidatorFactoryConfigurationHelper - HV000234: Using org.hibernate.validator.internal.engine.DefaultClockProvider as ValidatorFactory-scoped clock provider.
- 16:02:57.612 [main] DEBUG org.hibernate.validator.internal.engine.ValidatorFactoryConfigurationHelper - HV000234: Using org.hibernate.validator.internal.engine.scripting.DefaultScriptEvaluatorFactory as ValidatorFactory-scoped script evaluator factory.
- 16:02:57.613 [main] DEBUG _org.springframework.web.servlet.HandlerMapping.Mappings -
- c.z.w.c.c.CockpitFacilityGeometryController:
- {GET [/api/cockpit/v1/infrastructure/geometry]}: geometry()
- 16:02:57.613 [main] DEBUG org.springframework.web.servlet.mvc.method.annotation.RequestMappingHandlerMapping - 1 mappings in org.springframework.web.servlet.mvc.method.annotation.RequestMappingHandlerMapping
- 16:02:57.616 [main] DEBUG org.springframework.web.servlet.mvc.method.annotation.RequestMappingHandlerAdapter - ControllerAdvice beans: 0 @ModelAttribute, 0 @InitBinder, 1 RequestBodyAdvice, 1 ResponseBodyAdvice
- 16:02:57.617 [main] DEBUG org.springframework.web.servlet.mvc.method.annotation.ExceptionHandlerExceptionResolver - ControllerAdvice beans: 0 @ExceptionHandler, 1 ResponseBodyAdvice
- 16:02:57.618 [main] INFO org.springframework.mock.web.MockServletContext - Initializing Spring TestDispatcherServlet ''
- 16:02:57.618 [main] INFO org.springframework.test.web.servlet.TestDispatcherServlet - Initializing Servlet ''
- 16:02:57.618 [main] DEBUG org.springframework.test.web.servlet.TestDispatcherServlet - Detected AcceptHeaderLocaleResolver
- 16:02:57.618 [main] DEBUG org.springframework.test.web.servlet.TestDispatcherServlet - Detected FixedThemeResolver
- 16:02:57.618 [main] DEBUG org.springframework.test.web.servlet.TestDispatcherServlet - Detected org.springframework.web.servlet.view.DefaultRequestToViewNameTranslator@3f5dfe69
- 16:02:57.618 [main] DEBUG org.springframework.test.web.servlet.TestDispatcherServlet - Detected org.springframework.web.servlet.support.SessionFlashMapManager@571a663c
- 16:02:57.618 [main] DEBUG org.springframework.test.web.servlet.TestDispatcherServlet - enableLoggingRequestDetails='false': request parameters and headers will be masked to prevent unsafe logging of potentially sensitive data
- 16:02:57.618 [main] INFO org.springframework.test.web.servlet.TestDispatcherServlet - Completed initialization in 0 ms
- 16:02:57.619 [main] DEBUG org.springframework.test.web.servlet.TestDispatcherServlet - GET "/api/cockpit/v1/infrastructure/geometry", parameters={}
- 16:02:57.619 [main] DEBUG org.springframework.web.servlet.mvc.method.annotation.RequestMappingHandlerMapping - Mapped to com.zksy.web.controller.cockpit.CockpitFacilityGeometryController#geometry()
- 16:02:57.621 [main] DEBUG org.springframework.web.servlet.mvc.method.annotation.ExceptionHandlerExceptionResolver - Using @ExceptionHandler com.zksy.web.controller.cockpit.CockpitFacilityGeometryController#handleReadFailure(HttpServletRequest, RuntimeException)
- 16:02:57.621 [main] ERROR com.zksy.web.controller.cockpit.CockpitFacilityGeometryController - Facility geometry read failed
- com.zksy.cockpit.foundation.CockpitReadException: private database details
- at com.zksy.web.controller.cockpit.CockpitFacilityGeometryController.geometry(CockpitFacilityGeometryController.java:31)
- at java.base/jdk.internal.reflect.NativeMethodAccessorImpl.invoke0(Native Method)
- at java.base/jdk.internal.reflect.NativeMethodAccessorImpl.invoke(NativeMethodAccessorImpl.java:77)
- at java.base/jdk.internal.reflect.DelegatingMethodAccessorImpl.invoke(DelegatingMethodAccessorImpl.java:43)
- at java.base/java.lang.reflect.Method.invoke(Method.java:568)
- at org.springframework.web.method.support.InvocableHandlerMethod.doInvoke(InvocableHandlerMethod.java:205)
- at org.springframework.web.method.support.InvocableHandlerMethod.invokeForRequest(InvocableHandlerMethod.java:150)
- at org.springframework.web.servlet.mvc.method.annotation.ServletInvocableHandlerMethod.invokeAndHandle(ServletInvocableHandlerMethod.java:117)
- at org.springframework.web.servlet.mvc.method.annotation.RequestMappingHandlerAdapter.invokeHandlerMethod(RequestMappingHandlerAdapter.java:903)
- at org.springframework.web.servlet.mvc.method.annotation.RequestMappingHandlerAdapter.handleInternal(RequestMappingHandlerAdapter.java:809)
- at org.springframework.web.servlet.mvc.method.AbstractHandlerMethodAdapter.handle(AbstractHandlerMethodAdapter.java:87)
- at org.springframework.web.servlet.DispatcherServlet.doDispatch(DispatcherServlet.java:1072)
- at org.springframework.web.servlet.DispatcherServlet.doService(DispatcherServlet.java:965)
- at org.springframework.web.servlet.FrameworkServlet.processRequest(FrameworkServlet.java:1006)
- at org.springframework.web.servlet.FrameworkServlet.doGet(FrameworkServlet.java:898)
- at javax.servlet.http.HttpServlet.service(HttpServlet.java:529)
- at org.springframework.web.servlet.FrameworkServlet.service(FrameworkServlet.java:883)
- at org.springframework.test.web.servlet.TestDispatcherServlet.service(TestDispatcherServlet.java:72)
- at javax.servlet.http.HttpServlet.service(HttpServlet.java:623)
- at org.springframework.mock.web.MockFilterChain$ServletFilterProxy.doFilter(MockFilterChain.java:167)
- at org.springframework.mock.web.MockFilterChain.doFilter(MockFilterChain.java:134)
- at org.springframework.test.web.servlet.MockMvc.perform(MockMvc.java:201)
- at com.zksy.web.controller.cockpit.CockpitFacilityGeometryControllerTest.sourceFailureReturns500AndStableCategoryRatherThanSuccess(CockpitFacilityGeometryControllerTest.java:88)
- at java.base/jdk.internal.reflect.NativeMethodAccessorImpl.invoke0(Native Method)
- at java.base/jdk.internal.reflect.NativeMethodAccessorImpl.invoke(NativeMethodAccessorImpl.java:77)
- at java.base/jdk.internal.reflect.DelegatingMethodAccessorImpl.invoke(DelegatingMethodAccessorImpl.java:43)
- at java.base/java.lang.reflect.Method.invoke(Method.java:568)
- at org.junit.platform.commons.util.ReflectionUtils.invokeMethod(ReflectionUtils.java:688)
- at org.junit.jupiter.engine.execution.MethodInvocation.proceed(MethodInvocation.java:60)
- at org.junit.jupiter.engine.execution.InvocationInterceptorChain$ValidatingInvocation.proceed(InvocationInterceptorChain.java:131)
- at org.junit.jupiter.engine.extension.TimeoutExtension.intercept(TimeoutExtension.java:149)
- at org.junit.jupiter.engine.extension.TimeoutExtension.interceptTestableMethod(TimeoutExtension.java:140)
- at org.junit.jupiter.engine.extension.TimeoutExtension.interceptTestMethod(TimeoutExtension.java:84)
- at org.junit.jupiter.engine.execution.ExecutableInvoker$ReflectiveInterceptorCall.lambda$ofVoidMethod$0(ExecutableInvoker.java:115)
- at org.junit.jupiter.engine.execution.ExecutableInvoker.lambda$invoke$0(ExecutableInvoker.java:105)
- at org.junit.jupiter.engine.execution.InvocationInterceptorChain$InterceptedInvocation.proceed(InvocationInterceptorChain.java:106)
- at org.junit.jupiter.engine.execution.InvocationInterceptorChain.proceed(InvocationInterceptorChain.java:64)
- at org.junit.jupiter.engine.execution.InvocationInterceptorChain.chainAndInvoke(InvocationInterceptorChain.java:45)
- at org.junit.jupiter.engine.execution.InvocationInterceptorChain.invoke(InvocationInterceptorChain.java:37)
- at org.junit.jupiter.engine.execution.ExecutableInvoker.invoke(ExecutableInvoker.java:104)
- at org.junit.jupiter.engine.execution.ExecutableInvoker.invoke(ExecutableInvoker.java:98)
- at org.junit.jupiter.engine.descriptor.TestMethodTestDescriptor.lambda$invokeTestMethod$6(TestMethodTestDescriptor.java:210)
- at org.junit.platform.engine.support.hierarchical.ThrowableCollector.execute(ThrowableCollector.java:73)
- at org.junit.jupiter.engine.descriptor.TestMethodTestDescriptor.invokeTestMethod(TestMethodTestDescriptor.java:206)
- at org.junit.jupiter.engine.descriptor.TestMethodTestDescriptor.execute(TestMethodTestDescriptor.java:131)
- at org.junit.jupiter.engine.descriptor.TestMethodTestDescriptor.execute(TestMethodTestDescriptor.java:65)
- at org.junit.platform.engine.support.hierarchical.NodeTestTask.lambda$executeRecursively$5(NodeTestTask.java:139)
- at org.junit.platform.engine.support.hierarchical.ThrowableCollector.execute(ThrowableCollector.java:73)
- at org.junit.platform.engine.support.hierarchical.NodeTestTask.lambda$executeRecursively$7(NodeTestTask.java:129)
- at org.junit.platform.engine.support.hierarchical.Node.around(Node.java:137)
- at org.junit.platform.engine.support.hierarchical.NodeTestTask.lambda$executeRecursively$8(NodeTestTask.java:127)
- at org.junit.platform.engine.support.hierarchical.ThrowableCollector.execute(ThrowableCollector.java:73)
- at org.junit.platform.engine.support.hierarchical.NodeTestTask.executeRecursively(NodeTestTask.java:126)
- at org.junit.platform.engine.support.hierarchical.NodeTestTask.execute(NodeTestTask.java:84)
- at java.base/java.util.ArrayList.forEach(ArrayList.java:1511)
- at org.junit.platform.engine.support.hierarchical.SameThreadHierarchicalTestExecutorService.invokeAll(SameThreadHierarchicalTestExecutorService.java:38)
- at org.junit.platform.engine.support.hierarchical.NodeTestTask.lambda$executeRecursively$5(NodeTestTask.java:143)
- at org.junit.platform.engine.support.hierarchical.ThrowableCollector.execute(ThrowableCollector.java:73)
- at org.junit.platform.engine.support.hierarchical.NodeTestTask.lambda$executeRecursively$7(NodeTestTask.java:129)
- at org.junit.platform.engine.support.hierarchical.Node.around(Node.java:137)
- at org.junit.platform.engine.support.hierarchical.NodeTestTask.lambda$executeRecursively$8(NodeTestTask.java:127)
- at org.junit.platform.engine.support.hierarchical.ThrowableCollector.execute(ThrowableCollector.java:73)
- at org.junit.platform.engine.support.hierarchical.NodeTestTask.executeRecursively(NodeTestTask.java:126)
- at org.junit.platform.engine.support.hierarchical.NodeTestTask.execute(NodeTestTask.java:84)
- at java.base/java.util.ArrayList.forEach(ArrayList.java:1511)
- at org.junit.platform.engine.support.hierarchical.SameThreadHierarchicalTestExecutorService.invokeAll(SameThreadHierarchicalTestExecutorService.java:38)
- at org.junit.platform.engine.support.hierarchical.NodeTestTask.lambda$executeRecursively$5(NodeTestTask.java:143)
- at org.junit.platform.engine.support.hierarchical.ThrowableCollector.execute(ThrowableCollector.java:73)
- at org.junit.platform.engine.support.hierarchical.NodeTestTask.lambda$executeRecursively$7(NodeTestTask.java:129)
- at org.junit.platform.engine.support.hierarchical.Node.around(Node.java:137)
- at org.junit.platform.engine.support.hierarchical.NodeTestTask.lambda$executeRecursively$8(NodeTestTask.java:127)
- at org.junit.platform.engine.support.hierarchical.ThrowableCollector.execute(ThrowableCollector.java:73)
- at org.junit.platform.engine.support.hierarchical.NodeTestTask.executeRecursively(NodeTestTask.java:126)
- at org.junit.platform.engine.support.hierarchical.NodeTestTask.execute(NodeTestTask.java:84)
- at org.junit.platform.engine.support.hierarchical.SameThreadHierarchicalTestExecutorService.submit(SameThreadHierarchicalTestExecutorService.java:32)
- at org.junit.platform.engine.support.hierarchical.HierarchicalTestExecutor.execute(HierarchicalTestExecutor.java:57)
- at org.junit.platform.engine.support.hierarchical.HierarchicalTestEngine.execute(HierarchicalTestEngine.java:51)
- at org.junit.platform.launcher.core.DefaultLauncher.execute(DefaultLauncher.java:220)
- at org.junit.platform.launcher.core.DefaultLauncher.lambda$execute$6(DefaultLauncher.java:188)
- at org.junit.platform.launcher.core.DefaultLauncher.withInterceptedStreams(DefaultLauncher.java:202)
- at org.junit.platform.launcher.core.DefaultLauncher.execute(DefaultLauncher.java:181)
- at org.junit.platform.launcher.core.DefaultLauncher.execute(DefaultLauncher.java:128)
- at org.apache.maven.surefire.junitplatform.JUnitPlatformProvider.invokeAllTests(JUnitPlatformProvider.java:150)
- at org.apache.maven.surefire.junitplatform.JUnitPlatformProvider.invoke(JUnitPlatformProvider.java:124)
- at org.apache.maven.surefire.booter.ForkedBooter.invokeProviderInSameClassLoader(ForkedBooter.java:384)
- at org.apache.maven.surefire.booter.ForkedBooter.runSuitesInProcess(ForkedBooter.java:345)
- at org.apache.maven.surefire.booter.ForkedBooter.execute(ForkedBooter.java:126)
- at org.apache.maven.surefire.booter.ForkedBooter.main(ForkedBooter.java:418)
- 16:02:57.623 [main] DEBUG org.springframework.web.servlet.mvc.method.annotation.HttpEntityMethodProcessor - Using 'application/json', given [*/*] and supported [application/json, application/*+json]
- 16:02:57.623 [main] DEBUG org.springframework.web.servlet.mvc.method.annotation.HttpEntityMethodProcessor - Writing [{msg=facility geometry source unavailable, code=500, data=com.zksy.cockpit.foundation.CockpitErrorPa (truncated)...]
- 16:02:57.624 [main] DEBUG org.springframework.web.servlet.mvc.method.annotation.ExceptionHandlerExceptionResolver - Resolved [com.zksy.cockpit.foundation.CockpitReadException: private database details]
- 16:02:57.624 [main] DEBUG org.springframework.test.web.servlet.TestDispatcherServlet - Completed 500 INTERNAL_SERVER_ERROR
- 16:02:57.625 [main] DEBUG com.jayway.jsonpath.internal.path.CompiledPath - Evaluating path: $['code']
- 16:02:57.625 [main] DEBUG com.jayway.jsonpath.internal.path.CompiledPath - Evaluating path: $['data']['category']
- 16:02:57.626 [main] DEBUG com.jayway.jsonpath.internal.path.CompiledPath - Evaluating path: $['data']['message']
- 16:02:57.626 [main] DEBUG com.jayway.jsonpath.internal.path.CompiledPath - Evaluating path: $['data']['requestId']
- [INFO] Tests run: 6, Failures: 0, Errors: 0, Skipped: 0, Time elapsed: 1.626 s - in com.zksy.web.controller.cockpit.CockpitFacilityGeometryControllerTest
- [INFO] Running com.zksy.web.controller.cockpit.CockpitFacilityGeometryServiceTest
- 16:02:57.707 [main] ERROR com.zksy.cockpit.geometry.CockpitFacilityGeometryService - Facility geometry source read failed
- java.lang.IllegalStateException: private database detail
- at com.zksy.cockpit.geometry.CockpitFacilityGeometryService.load(CockpitFacilityGeometryService.java:60)
- at org.junit.jupiter.api.AssertThrows.assertThrows(AssertThrows.java:55)
- at org.junit.jupiter.api.AssertThrows.assertThrows(AssertThrows.java:37)
- at org.junit.jupiter.api.Assertions.assertThrows(Assertions.java:3007)
- at com.zksy.web.controller.cockpit.CockpitFacilityGeometryServiceTest.aFailedSourceNeverProducesAnEmptyOrPartialSuccess(CockpitFacilityGeometryServiceTest.java:273)
- at java.base/jdk.internal.reflect.NativeMethodAccessorImpl.invoke0(Native Method)
- at java.base/jdk.internal.reflect.NativeMethodAccessorImpl.invoke(NativeMethodAccessorImpl.java:77)
- at java.base/jdk.internal.reflect.DelegatingMethodAccessorImpl.invoke(DelegatingMethodAccessorImpl.java:43)
- at java.base/java.lang.reflect.Method.invoke(Method.java:568)
- at org.junit.platform.commons.util.ReflectionUtils.invokeMethod(ReflectionUtils.java:688)
- at org.junit.jupiter.engine.execution.MethodInvocation.proceed(MethodInvocation.java:60)
- at org.junit.jupiter.engine.execution.InvocationInterceptorChain$ValidatingInvocation.proceed(InvocationInterceptorChain.java:131)
- at org.junit.jupiter.engine.extension.TimeoutExtension.intercept(TimeoutExtension.java:149)
- at org.junit.jupiter.engine.extension.TimeoutExtension.interceptTestableMethod(TimeoutExtension.java:140)
- at org.junit.jupiter.engine.extension.TimeoutExtension.interceptTestMethod(TimeoutExtension.java:84)
- at org.junit.jupiter.engine.execution.ExecutableInvoker$ReflectiveInterceptorCall.lambda$ofVoidMethod$0(ExecutableInvoker.java:115)
- at org.junit.jupiter.engine.execution.ExecutableInvoker.lambda$invoke$0(ExecutableInvoker.java:105)
- at org.junit.jupiter.engine.execution.InvocationInterceptorChain$InterceptedInvocation.proceed(InvocationInterceptorChain.java:106)
- at org.junit.jupiter.engine.execution.InvocationInterceptorChain.proceed(InvocationInterceptorChain.java:64)
- at org.junit.jupiter.engine.execution.InvocationInterceptorChain.chainAndInvoke(InvocationInterceptorChain.java:45)
- at org.junit.jupiter.engine.execution.InvocationInterceptorChain.invoke(InvocationInterceptorChain.java:37)
- at org.junit.jupiter.engine.execution.ExecutableInvoker.invoke(ExecutableInvoker.java:104)
- at org.junit.jupiter.engine.execution.ExecutableInvoker.invoke(ExecutableInvoker.java:98)
- at org.junit.jupiter.engine.descriptor.TestMethodTestDescriptor.lambda$invokeTestMethod$6(TestMethodTestDescriptor.java:210)
- at org.junit.platform.engine.support.hierarchical.ThrowableCollector.execute(ThrowableCollector.java:73)
- at org.junit.jupiter.engine.descriptor.TestMethodTestDescriptor.invokeTestMethod(TestMethodTestDescriptor.java:206)
- at org.junit.jupiter.engine.descriptor.TestMethodTestDescriptor.execute(TestMethodTestDescriptor.java:131)
- at org.junit.jupiter.engine.descriptor.TestMethodTestDescriptor.execute(TestMethodTestDescriptor.java:65)
- at org.junit.platform.engine.support.hierarchical.NodeTestTask.lambda$executeRecursively$5(NodeTestTask.java:139)
- at org.junit.platform.engine.support.hierarchical.ThrowableCollector.execute(ThrowableCollector.java:73)
- at org.junit.platform.engine.support.hierarchical.NodeTestTask.lambda$executeRecursively$7(NodeTestTask.java:129)
- at org.junit.platform.engine.support.hierarchical.Node.around(Node.java:137)
- at org.junit.platform.engine.support.hierarchical.NodeTestTask.lambda$executeRecursively$8(NodeTestTask.java:127)
- at org.junit.platform.engine.support.hierarchical.ThrowableCollector.execute(ThrowableCollector.java:73)
- at org.junit.platform.engine.support.hierarchical.NodeTestTask.executeRecursively(NodeTestTask.java:126)
- at org.junit.platform.engine.support.hierarchical.NodeTestTask.execute(NodeTestTask.java:84)
- at java.base/java.util.ArrayList.forEach(ArrayList.java:1511)
- at org.junit.platform.engine.support.hierarchical.SameThreadHierarchicalTestExecutorService.invokeAll(SameThreadHierarchicalTestExecutorService.java:38)
- at org.junit.platform.engine.support.hierarchical.NodeTestTask.lambda$executeRecursively$5(NodeTestTask.java:143)
- at org.junit.platform.engine.support.hierarchical.ThrowableCollector.execute(ThrowableCollector.java:73)
- at org.junit.platform.engine.support.hierarchical.NodeTestTask.lambda$executeRecursively$7(NodeTestTask.java:129)
- at org.junit.platform.engine.support.hierarchical.Node.around(Node.java:137)
- at org.junit.platform.engine.support.hierarchical.NodeTestTask.lambda$executeRecursively$8(NodeTestTask.java:127)
- at org.junit.platform.engine.support.hierarchical.ThrowableCollector.execute(ThrowableCollector.java:73)
- at org.junit.platform.engine.support.hierarchical.NodeTestTask.executeRecursively(NodeTestTask.java:126)
- at org.junit.platform.engine.support.hierarchical.NodeTestTask.execute(NodeTestTask.java:84)
- at java.base/java.util.ArrayList.forEach(ArrayList.java:1511)
- at org.junit.platform.engine.support.hierarchical.SameThreadHierarchicalTestExecutorService.invokeAll(SameThreadHierarchicalTestExecutorService.java:38)
- at org.junit.platform.engine.support.hierarchical.NodeTestTask.lambda$executeRecursively$5(NodeTestTask.java:143)
- at org.junit.platform.engine.support.hierarchical.ThrowableCollector.execute(ThrowableCollector.java:73)
- at org.junit.platform.engine.support.hierarchical.NodeTestTask.lambda$executeRecursively$7(NodeTestTask.java:129)
- at org.junit.platform.engine.support.hierarchical.Node.around(Node.java:137)
- at org.junit.platform.engine.support.hierarchical.NodeTestTask.lambda$executeRecursively$8(NodeTestTask.java:127)
- at org.junit.platform.engine.support.hierarchical.ThrowableCollector.execute(ThrowableCollector.java:73)
- at org.junit.platform.engine.support.hierarchical.NodeTestTask.executeRecursively(NodeTestTask.java:126)
- at org.junit.platform.engine.support.hierarchical.NodeTestTask.execute(NodeTestTask.java:84)
- at org.junit.platform.engine.support.hierarchical.SameThreadHierarchicalTestExecutorService.submit(SameThreadHierarchicalTestExecutorService.java:32)
- at org.junit.platform.engine.support.hierarchical.HierarchicalTestExecutor.execute(HierarchicalTestExecutor.java:57)
- at org.junit.platform.engine.support.hierarchical.HierarchicalTestEngine.execute(HierarchicalTestEngine.java:51)
- at org.junit.platform.launcher.core.DefaultLauncher.execute(DefaultLauncher.java:220)
- at org.junit.platform.launcher.core.DefaultLauncher.lambda$execute$6(DefaultLauncher.java:188)
- at org.junit.platform.launcher.core.DefaultLauncher.withInterceptedStreams(DefaultLauncher.java:202)
- at org.junit.platform.launcher.core.DefaultLauncher.execute(DefaultLauncher.java:181)
- at org.junit.platform.launcher.core.DefaultLauncher.execute(DefaultLauncher.java:128)
- at org.apache.maven.surefire.junitplatform.JUnitPlatformProvider.invokeAllTests(JUnitPlatformProvider.java:150)
- at org.apache.maven.surefire.junitplatform.JUnitPlatformProvider.invoke(JUnitPlatformProvider.java:124)
- at org.apache.maven.surefire.booter.ForkedBooter.invokeProviderInSameClassLoader(ForkedBooter.java:384)
- at org.apache.maven.surefire.booter.ForkedBooter.runSuitesInProcess(ForkedBooter.java:345)
- at org.apache.maven.surefire.booter.ForkedBooter.execute(ForkedBooter.java:126)
- at org.apache.maven.surefire.booter.ForkedBooter.main(ForkedBooter.java:418)
- 16:02:57.736 [main] ERROR com.zksy.cockpit.geometry.CockpitFacilityGeometryService - Facility geometry source read failed
- java.lang.NullPointerException: null
- at java.base/java.util.Objects.requireNonNull(Objects.java:208)
- at com.zksy.cockpit.geometry.CockpitFacilityGeometryService.load(CockpitFacilityGeometryService.java:66)
- at org.junit.jupiter.api.AssertThrows.assertThrows(AssertThrows.java:55)
- at org.junit.jupiter.api.AssertThrows.assertThrows(AssertThrows.java:37)
- at org.junit.jupiter.api.Assertions.assertThrows(Assertions.java:3007)
- at com.zksy.web.controller.cockpit.CockpitFacilityGeometryServiceTest.aNullSourceIsAReadFailureRatherThanASuccessfulEmptyCollection(CockpitFacilityGeometryServiceTest.java:281)
- at java.base/jdk.internal.reflect.NativeMethodAccessorImpl.invoke0(Native Method)
- at java.base/jdk.internal.reflect.NativeMethodAccessorImpl.invoke(NativeMethodAccessorImpl.java:77)
- at java.base/jdk.internal.reflect.DelegatingMethodAccessorImpl.invoke(DelegatingMethodAccessorImpl.java:43)
- at java.base/java.lang.reflect.Method.invoke(Method.java:568)
- at org.junit.platform.commons.util.ReflectionUtils.invokeMethod(ReflectionUtils.java:688)
- at org.junit.jupiter.engine.execution.MethodInvocation.proceed(MethodInvocation.java:60)
- at org.junit.jupiter.engine.execution.InvocationInterceptorChain$ValidatingInvocation.proceed(InvocationInterceptorChain.java:131)
- at org.junit.jupiter.engine.extension.TimeoutExtension.intercept(TimeoutExtension.java:149)
- at org.junit.jupiter.engine.extension.TimeoutExtension.interceptTestableMethod(TimeoutExtension.java:140)
- at org.junit.jupiter.engine.extension.TimeoutExtension.interceptTestMethod(TimeoutExtension.java:84)
- at org.junit.jupiter.engine.execution.ExecutableInvoker$ReflectiveInterceptorCall.lambda$ofVoidMethod$0(ExecutableInvoker.java:115)
- at org.junit.jupiter.engine.execution.ExecutableInvoker.lambda$invoke$0(ExecutableInvoker.java:105)
- at org.junit.jupiter.engine.execution.InvocationInterceptorChain$InterceptedInvocation.proceed(InvocationInterceptorChain.java:106)
- at org.junit.jupiter.engine.execution.InvocationInterceptorChain.proceed(InvocationInterceptorChain.java:64)
- at org.junit.jupiter.engine.execution.InvocationInterceptorChain.chainAndInvoke(InvocationInterceptorChain.java:45)
- at org.junit.jupiter.engine.execution.InvocationInterceptorChain.invoke(InvocationInterceptorChain.java:37)
- at org.junit.jupiter.engine.execution.ExecutableInvoker.invoke(ExecutableInvoker.java:104)
- at org.junit.jupiter.engine.execution.ExecutableInvoker.invoke(ExecutableInvoker.java:98)
- at org.junit.jupiter.engine.descriptor.TestMethodTestDescriptor.lambda$invokeTestMethod$6(TestMethodTestDescriptor.java:210)
- at org.junit.platform.engine.support.hierarchical.ThrowableCollector.execute(ThrowableCollector.java:73)
- at org.junit.jupiter.engine.descriptor.TestMethodTestDescriptor.invokeTestMethod(TestMethodTestDescriptor.java:206)
- at org.junit.jupiter.engine.descriptor.TestMethodTestDescriptor.execute(TestMethodTestDescriptor.java:131)
- at org.junit.jupiter.engine.descriptor.TestMethodTestDescriptor.execute(TestMethodTestDescriptor.java:65)
- at org.junit.platform.engine.support.hierarchical.NodeTestTask.lambda$executeRecursively$5(NodeTestTask.java:139)
- at org.junit.platform.engine.support.hierarchical.ThrowableCollector.execute(ThrowableCollector.java:73)
- at org.junit.platform.engine.support.hierarchical.NodeTestTask.lambda$executeRecursively$7(NodeTestTask.java:129)
- at org.junit.platform.engine.support.hierarchical.Node.around(Node.java:137)
- at org.junit.platform.engine.support.hierarchical.NodeTestTask.lambda$executeRecursively$8(NodeTestTask.java:127)
- at org.junit.platform.engine.support.hierarchical.ThrowableCollector.execute(ThrowableCollector.java:73)
- at org.junit.platform.engine.support.hierarchical.NodeTestTask.executeRecursively(NodeTestTask.java:126)
- at org.junit.platform.engine.support.hierarchical.NodeTestTask.execute(NodeTestTask.java:84)
- at java.base/java.util.ArrayList.forEach(ArrayList.java:1511)
- at org.junit.platform.engine.support.hierarchical.SameThreadHierarchicalTestExecutorService.invokeAll(SameThreadHierarchicalTestExecutorService.java:38)
- at org.junit.platform.engine.support.hierarchical.NodeTestTask.lambda$executeRecursively$5(NodeTestTask.java:143)
- at org.junit.platform.engine.support.hierarchical.ThrowableCollector.execute(ThrowableCollector.java:73)
- at org.junit.platform.engine.support.hierarchical.NodeTestTask.lambda$executeRecursively$7(NodeTestTask.java:129)
- at org.junit.platform.engine.support.hierarchical.Node.around(Node.java:137)
- at org.junit.platform.engine.support.hierarchical.NodeTestTask.lambda$executeRecursively$8(NodeTestTask.java:127)
- at org.junit.platform.engine.support.hierarchical.ThrowableCollector.execute(ThrowableCollector.java:73)
- at org.junit.platform.engine.support.hierarchical.NodeTestTask.executeRecursively(NodeTestTask.java:126)
- at org.junit.platform.engine.support.hierarchical.NodeTestTask.execute(NodeTestTask.java:84)
- at java.base/java.util.ArrayList.forEach(ArrayList.java:1511)
- at org.junit.platform.engine.support.hierarchical.SameThreadHierarchicalTestExecutorService.invokeAll(SameThreadHierarchicalTestExecutorService.java:38)
- at org.junit.platform.engine.support.hierarchical.NodeTestTask.lambda$executeRecursively$5(NodeTestTask.java:143)
- at org.junit.platform.engine.support.hierarchical.ThrowableCollector.execute(ThrowableCollector.java:73)
- at org.junit.platform.engine.support.hierarchical.NodeTestTask.lambda$executeRecursively$7(NodeTestTask.java:129)
- at org.junit.platform.engine.support.hierarchical.Node.around(Node.java:137)
- at org.junit.platform.engine.support.hierarchical.NodeTestTask.lambda$executeRecursively$8(NodeTestTask.java:127)
- at org.junit.platform.engine.support.hierarchical.ThrowableCollector.execute(ThrowableCollector.java:73)
- at org.junit.platform.engine.support.hierarchical.NodeTestTask.executeRecursively(NodeTestTask.java:126)
- at org.junit.platform.engine.support.hierarchical.NodeTestTask.execute(NodeTestTask.java:84)
- at org.junit.platform.engine.support.hierarchical.SameThreadHierarchicalTestExecutorService.submit(SameThreadHierarchicalTestExecutorService.java:32)
- at org.junit.platform.engine.support.hierarchical.HierarchicalTestExecutor.execute(HierarchicalTestExecutor.java:57)
- at org.junit.platform.engine.support.hierarchical.HierarchicalTestEngine.execute(HierarchicalTestEngine.java:51)
- at org.junit.platform.launcher.core.DefaultLauncher.execute(DefaultLauncher.java:220)
- at org.junit.platform.launcher.core.DefaultLauncher.lambda$execute$6(DefaultLauncher.java:188)
- at org.junit.platform.launcher.core.DefaultLauncher.withInterceptedStreams(DefaultLauncher.java:202)
- at org.junit.platform.launcher.core.DefaultLauncher.execute(DefaultLauncher.java:181)
- at org.junit.platform.launcher.core.DefaultLauncher.execute(DefaultLauncher.java:128)
- at org.apache.maven.surefire.junitplatform.JUnitPlatformProvider.invokeAllTests(JUnitPlatformProvider.java:150)
- at org.apache.maven.surefire.junitplatform.JUnitPlatformProvider.invoke(JUnitPlatformProvider.java:124)
- at org.apache.maven.surefire.booter.ForkedBooter.invokeProviderInSameClassLoader(ForkedBooter.java:384)
- at org.apache.maven.surefire.booter.ForkedBooter.runSuitesInProcess(ForkedBooter.java:345)
- at org.apache.maven.surefire.booter.ForkedBooter.execute(ForkedBooter.java:126)
- at org.apache.maven.surefire.booter.ForkedBooter.main(ForkedBooter.java:418)
- [ERROR] Tests run: 17, Failures: 0, Errors: 1, Skipped: 0, Time elapsed: 0.103 s <<< FAILURE! - in com.zksy.web.controller.cockpit.CockpitFacilityGeometryServiceTest
- [ERROR] exposesNetworkLevelForDrainageAndDefaultsLegacyMissingLevelWithoutMutatingSource Time elapsed: 0.02 s <<< ERROR!
- java.lang.NullPointerException: Cannot invoke "com.fasterxml.jackson.databind.JsonNode.asText()" because the return value of "com.fasterxml.jackson.databind.JsonNode.get(String)" is null
- at com.zksy.web.controller.cockpit.CockpitFacilityGeometryServiceTest.exposesNetworkLevelForDrainageAndDefaultsLegacyMissingLevelWithoutMutatingSource(CockpitFacilityGeometryServiceTest.java:149)
- [INFO]
- [INFO] Results:
- [INFO]
- [ERROR] Errors:
- [ERROR] CockpitFacilityGeometryServiceTest.exposesNetworkLevelForDrainageAndDefaultsLegacyMissingLevelWithoutMutatingSource:149 NullPointer
- [INFO]
- [ERROR] Tests run: 23, Failures: 0, Errors: 1, Skipped: 0
- [INFO]
- [INFO] ------------------------------------------------------------------------
- [INFO] Reactor Summary:
- [INFO]
- [INFO] pipe-ner-server 1.0.0 .............................. SUCCESS [ 0.003 s]
- [INFO] pipe-network-service 3.9.0 ......................... SUCCESS [ 0.001 s]
- [INFO] zksy-common 3.9.0 .................................. SUCCESS [ 1.029 s]
- [INFO] zksy-system 3.9.0 .................................. SUCCESS [ 12.419 s]
- [INFO] zksy-framework 3.9.0 ............................... SUCCESS [ 0.127 s]
- [INFO] zksy-quartz 3.9.0 .................................. SUCCESS [ 0.606 s]
- [INFO] zksy-generator 3.9.0 ............................... SUCCESS [ 0.065 s]
- [INFO] zksy-admin 3.9.0 ................................... FAILURE [ 7.288 s]
- [INFO] ------------------------------------------------------------------------
- [INFO] BUILD FAILURE
- [INFO] ------------------------------------------------------------------------
- [INFO] Total time: 22.016 s
- [INFO] Finished at: 2026-10-14T16:02:58+08:00
- [INFO] ------------------------------------------------------------------------
- [ERROR] Failed to execute goal org.apache.maven.plugins:maven-surefire-plugin:2.22.2:test (default-test) on project zksy-admin: There are test failures.
- [ERROR]
- [ERROR] Please refer to E:\pipe-ner-server\pipe-network-service\zksy-admin\target\surefire-reports for the individual test results.
- [ERROR] Please refer to dump files (if any exist) [date].dump, [date]-jvmRun[N].dump and [date].dumpstream.
- [ERROR] -> [Help 1]
- [ERROR]
- [ERROR] To see the full stack trace of the errors, re-run Maven with the -e switch.
- [ERROR] Re-run Maven using the -X switch to enable full debug logging.
- [ERROR]
- [ERROR] For more information about the errors and possible solutions, please read the following articles:
- [ERROR] [Help 1] http://cwiki.apache.org/confluence/display/MAVEN/MojoFailureException
- [ERROR]
- [ERROR] After correcting the problems, you can resume the build with the command
- [ERROR] mvn <args> -rf :zksy-admin
|