remark-backend-tests.log 91 KB

123456789101112131415161718192021222324252627282930313233343536373839404142434445464748495051525354555657585960616263646566676869707172737475767778798081828384858687888990919293949596979899100101102103104105106107108109110111112113114115116117118119120121122123124125126127128129130131132133134135136137138139140141142143144145146147148149150151152153154155156157158159160161162163164165166167168169170171172173174175176177178179180181182183184185186187188189190191192193194195196197198199200201202203204205206207208209210211212213214215216217218219220221222223224225226227228229230231232233234235236237238239240241242243244245246247248249250251252253254255256257258259260261262263264265266267268269270271272273274275276277278279280281282283284285286287288289290291292293294295296297298299300301302303304305306307308309310311312313314315316317318319320321322323324325326327328329330331332333334335336337338339340341342343344345346347348349350351352353354355356357358359360361362363364365366367368369370371372373374375376377378379380381382383384385386387388389390391392393394395396397398399400401402403404405406407408409410411412413414415416417418419420421422423424425426427428429430431432433434435436437438439440441442443444445446447448449450451452453454455456457458459460461462463464465466467468469470471472473474475476477478479480481482483484485486487488489490491492493494495496497498499500501502503504505506507508509510511512513514515516517518519520521522523524525526527528529530531532533534535536537538539540541542543544545546547548549550551552553554555556557558559560561562563564565566567568569570571572573574575576577578579580581582583584585586587588589590591592593594595596597598599600601602603604605606607608609610611612613614615616617618619620621622623624625626627628629630631632633634635636637638639640641642643644645646647648649650651652653654655656657658659660661662663664665666667668669670671672673674675676677678679680681682683684685686687688689690691692693694695696697698699700701702703704705706707708709710711712713714715716717718719720721722723724725726727728729730731732733734735736737738739740741742743744745746747748749750751752753754755756757758759760761762763764765766767768769770771772773774775776777778779780781782783784785786787788789790791792793794795796797798799800801802803804805806807808809810811812813814815
  1. [INFO] Scanning for projects...
  2. [INFO] ------------------------------------------------------------------------
  3. [INFO] Reactor Build Order:
  4. [INFO]
  5. [INFO] pipe-ner-server [pom]
  6. [INFO] pipe-network-service [pom]
  7. [INFO] zksy-common [jar]
  8. [INFO] zksy-system [jar]
  9. [INFO] zksy-framework [jar]
  10. [INFO] zksy-quartz [jar]
  11. [INFO] zksy-generator [jar]
  12. [INFO] zksy-admin [jar]
  13. [INFO]
  14. [INFO] ----------------------< com.zksy:pipe-ner-server >----------------------
  15. [INFO] Building pipe-ner-server 1.0.0 [1/8]
  16. [INFO] from pom.xml
  17. [INFO] --------------------------------[ pom ]---------------------------------
  18. [INFO]
  19. [INFO] -------------------< com.zksy:pipe-network-service >--------------------
  20. [INFO] Building pipe-network-service 3.9.0 [2/8]
  21. [INFO] from pipe-network-service\pom.xml
  22. [INFO] --------------------------------[ pom ]---------------------------------
  23. [INFO]
  24. [INFO] ------------------------< com.zksy:zksy-common >------------------------
  25. [INFO] Building zksy-common 3.9.0 [3/8]
  26. [INFO] from pipe-network-service\zksy-common\pom.xml
  27. [INFO] --------------------------------[ jar ]---------------------------------
  28. [WARNING] Parameter 'parameters' is unknown for plugin 'maven-compiler-plugin:3.1:compile (default-compile)'
  29. [WARNING] Parameter 'parameters' is unknown for plugin 'maven-compiler-plugin:3.1:testCompile (default-testCompile)'
  30. [INFO]
  31. [INFO] --- resources:3.2.0:resources (default-resources) @ zksy-common ---
  32. [INFO] Using 'UTF-8' encoding to copy filtered resources.
  33. [INFO] Using 'UTF-8' encoding to copy filtered properties files.
  34. [INFO] skip non existing resourceDirectory E:\pipe-ner-server\pipe-network-service\zksy-common\src\main\resources
  35. [INFO] skip non existing resourceDirectory E:\pipe-ner-server\pipe-network-service\zksy-common\src\main\resources
  36. [INFO]
  37. [INFO] --- compiler:3.1:compile (default-compile) @ zksy-common ---
  38. [INFO] Nothing to compile - all classes are up to date
  39. [INFO]
  40. [INFO] --- resources:3.2.0:testResources (default-testResources) @ zksy-common ---
  41. [INFO] Using 'UTF-8' encoding to copy filtered resources.
  42. [INFO] Using 'UTF-8' encoding to copy filtered properties files.
  43. [INFO] skip non existing resourceDirectory E:\pipe-ner-server\pipe-network-service\zksy-common\src\test\resources
  44. [INFO]
  45. [INFO] --- compiler:3.1:testCompile (default-testCompile) @ zksy-common ---
  46. [INFO] No sources to compile
  47. [INFO]
  48. [INFO] --- surefire:2.22.2:test (default-test) @ zksy-common ---
  49. [INFO] No tests to run.
  50. [INFO]
  51. [INFO] ------------------------< com.zksy:zksy-system >------------------------
  52. [INFO] Building zksy-system 3.9.0 [4/8]
  53. [INFO] from pipe-network-service\zksy-system\pom.xml
  54. [INFO] --------------------------------[ jar ]---------------------------------
  55. [WARNING] Parameter 'parameters' is unknown for plugin 'maven-compiler-plugin:3.1:compile (default-compile)'
  56. [WARNING] Parameter 'parameters' is unknown for plugin 'maven-compiler-plugin:3.1:testCompile (default-testCompile)'
  57. [INFO]
  58. [INFO] --- resources:3.2.0:resources (default-resources) @ zksy-system ---
  59. [INFO] Using 'UTF-8' encoding to copy filtered resources.
  60. [INFO] Using 'UTF-8' encoding to copy filtered properties files.
  61. [INFO] Copying 0 resource
  62. [INFO] Copying 46 resources
  63. [INFO]
  64. [INFO] --- compiler:3.1:compile (default-compile) @ zksy-system ---
  65. [INFO] Changes detected - recompiling the module!
  66. [INFO] Compiling 761 source files to E:\pipe-ner-server\pipe-network-service\zksy-system\target\classes
  67. [WARNING] /E:/pipe-ner-server/pipe-network-service/zksy-system/src/main/java/com/zksy/base/video/VideoCollectorClient.java: E:\pipe-ner-server\pipe-network-service\zksy-system\src\main\java\com\zksy\base\video\VideoCollectorClient.java使用了未经检查或不安全的操作。
  68. [WARNING] /E:/pipe-ner-server/pipe-network-service/zksy-system/src/main/java/com/zksy/base/video/VideoCollectorClient.java: 有关详细信息, 请使用 -Xlint:unchecked 重新编译。
  69. [INFO]
  70. [INFO] --- resources:3.2.0:testResources (default-testResources) @ zksy-system ---
  71. [INFO] Using 'UTF-8' encoding to copy filtered resources.
  72. [INFO] Using 'UTF-8' encoding to copy filtered properties files.
  73. [INFO] skip non existing resourceDirectory E:\pipe-ner-server\pipe-network-service\zksy-system\src\test\resources
  74. [INFO]
  75. [INFO] --- compiler:3.1:testCompile (default-testCompile) @ zksy-system ---
  76. [INFO] Nothing to compile - all classes are up to date
  77. [INFO]
  78. [INFO] --- surefire:2.22.2:test (default-test) @ zksy-system ---
  79. [INFO]
  80. [INFO] ----------------------< com.zksy:zksy-framework >-----------------------
  81. [INFO] Building zksy-framework 3.9.0 [5/8]
  82. [INFO] from pipe-network-service\zksy-framework\pom.xml
  83. [INFO] --------------------------------[ jar ]---------------------------------
  84. [WARNING] Parameter 'parameters' is unknown for plugin 'maven-compiler-plugin:3.1:compile (default-compile)'
  85. [WARNING] Parameter 'parameters' is unknown for plugin 'maven-compiler-plugin:3.1:testCompile (default-testCompile)'
  86. [INFO]
  87. [INFO] --- resources:3.2.0:resources (default-resources) @ zksy-framework ---
  88. [INFO] Using 'UTF-8' encoding to copy filtered resources.
  89. [INFO] Using 'UTF-8' encoding to copy filtered properties files.
  90. [INFO] skip non existing resourceDirectory E:\pipe-ner-server\pipe-network-service\zksy-framework\src\main\resources
  91. [INFO] skip non existing resourceDirectory E:\pipe-ner-server\pipe-network-service\zksy-framework\src\main\resources
  92. [INFO]
  93. [INFO] --- compiler:3.1:compile (default-compile) @ zksy-framework ---
  94. [INFO] Nothing to compile - all classes are up to date
  95. [INFO]
  96. [INFO] --- resources:3.2.0:testResources (default-testResources) @ zksy-framework ---
  97. [INFO] Using 'UTF-8' encoding to copy filtered resources.
  98. [INFO] Using 'UTF-8' encoding to copy filtered properties files.
  99. [INFO] skip non existing resourceDirectory E:\pipe-ner-server\pipe-network-service\zksy-framework\src\test\resources
  100. [INFO]
  101. [INFO] --- compiler:3.1:testCompile (default-testCompile) @ zksy-framework ---
  102. [INFO] No sources to compile
  103. [INFO]
  104. [INFO] --- surefire:2.22.2:test (default-test) @ zksy-framework ---
  105. [INFO] No tests to run.
  106. [INFO]
  107. [INFO] ------------------------< com.zksy:zksy-quartz >------------------------
  108. [INFO] Building zksy-quartz 3.9.0 [6/8]
  109. [INFO] from pipe-network-service\zksy-quartz\pom.xml
  110. [INFO] --------------------------------[ jar ]---------------------------------
  111. [WARNING] Parameter 'parameters' is unknown for plugin 'maven-compiler-plugin:3.1:compile (default-compile)'
  112. [WARNING] Parameter 'parameters' is unknown for plugin 'maven-compiler-plugin:3.1:testCompile (default-testCompile)'
  113. [INFO]
  114. [INFO] --- resources:3.2.0:resources (default-resources) @ zksy-quartz ---
  115. [INFO] Using 'UTF-8' encoding to copy filtered resources.
  116. [INFO] Using 'UTF-8' encoding to copy filtered properties files.
  117. [INFO] Copying 0 resource
  118. [INFO] Copying 2 resources
  119. [INFO]
  120. [INFO] --- compiler:3.1:compile (default-compile) @ zksy-quartz ---
  121. [INFO] Changes detected - recompiling the module!
  122. [INFO] Compiling 18 source files to E:\pipe-ner-server\pipe-network-service\zksy-quartz\target\classes
  123. [INFO]
  124. [INFO] --- resources:3.2.0:testResources (default-testResources) @ zksy-quartz ---
  125. [INFO] Using 'UTF-8' encoding to copy filtered resources.
  126. [INFO] Using 'UTF-8' encoding to copy filtered properties files.
  127. [INFO] skip non existing resourceDirectory E:\pipe-ner-server\pipe-network-service\zksy-quartz\src\test\resources
  128. [INFO]
  129. [INFO] --- compiler:3.1:testCompile (default-testCompile) @ zksy-quartz ---
  130. [INFO] No sources to compile
  131. [INFO]
  132. [INFO] --- surefire:2.22.2:test (default-test) @ zksy-quartz ---
  133. [INFO] No tests to run.
  134. [INFO]
  135. [INFO] ----------------------< com.zksy:zksy-generator >-----------------------
  136. [INFO] Building zksy-generator 3.9.0 [7/8]
  137. [INFO] from pipe-network-service\zksy-generator\pom.xml
  138. [INFO] --------------------------------[ jar ]---------------------------------
  139. [WARNING] Parameter 'parameters' is unknown for plugin 'maven-compiler-plugin:3.1:compile (default-compile)'
  140. [WARNING] Parameter 'parameters' is unknown for plugin 'maven-compiler-plugin:3.1:testCompile (default-testCompile)'
  141. [INFO]
  142. [INFO] --- resources:3.2.0:resources (default-resources) @ zksy-generator ---
  143. [INFO] Using 'UTF-8' encoding to copy filtered resources.
  144. [INFO] Using 'UTF-8' encoding to copy filtered properties files.
  145. [INFO] Copying 0 resource
  146. [INFO] Copying 16 resources
  147. [INFO]
  148. [INFO] --- compiler:3.1:compile (default-compile) @ zksy-generator ---
  149. [INFO] Nothing to compile - all classes are up to date
  150. [INFO]
  151. [INFO] --- resources:3.2.0:testResources (default-testResources) @ zksy-generator ---
  152. [INFO] Using 'UTF-8' encoding to copy filtered resources.
  153. [INFO] Using 'UTF-8' encoding to copy filtered properties files.
  154. [INFO] skip non existing resourceDirectory E:\pipe-ner-server\pipe-network-service\zksy-generator\src\test\resources
  155. [INFO]
  156. [INFO] --- compiler:3.1:testCompile (default-testCompile) @ zksy-generator ---
  157. [INFO] No sources to compile
  158. [INFO]
  159. [INFO] --- surefire:2.22.2:test (default-test) @ zksy-generator ---
  160. [INFO] No tests to run.
  161. [INFO]
  162. [INFO] ------------------------< com.zksy:zksy-admin >-------------------------
  163. [INFO] Building zksy-admin 3.9.0 [8/8]
  164. [INFO] from pipe-network-service\zksy-admin\pom.xml
  165. [INFO] --------------------------------[ jar ]---------------------------------
  166. [WARNING] Parameter 'parameters' is unknown for plugin 'maven-compiler-plugin:3.1:compile (default-compile)'
  167. [WARNING] Parameter 'parameters' is unknown for plugin 'maven-compiler-plugin:3.1:testCompile (default-testCompile)'
  168. [WARNING] 1 problem was encountered while building the effective model for org.javassist:javassist:jar:3.21.0-GA during dependency collection step for project (use -X to see details)
  169. [INFO]
  170. [INFO] --- resources:3.2.0:resources (default-resources) @ zksy-admin ---
  171. [INFO] Using 'UTF-8' encoding to copy filtered resources.
  172. [INFO] Using 'UTF-8' encoding to copy filtered properties files.
  173. [INFO] Copying 4 resources
  174. [INFO] Copying 6 resources
  175. [INFO]
  176. [INFO] --- compiler:3.1:compile (default-compile) @ zksy-admin ---
  177. [INFO] Changes detected - recompiling the module!
  178. [INFO] Compiling 146 source files to E:\pipe-ner-server\pipe-network-service\zksy-admin\target\classes
  179. [INFO]
  180. [INFO] --- resources:3.2.0:testResources (default-testResources) @ zksy-admin ---
  181. [INFO] Using 'UTF-8' encoding to copy filtered resources.
  182. [INFO] Using 'UTF-8' encoding to copy filtered properties files.
  183. [INFO] skip non existing resourceDirectory E:\pipe-ner-server\pipe-network-service\zksy-admin\src\test\resources
  184. [INFO]
  185. [INFO] --- compiler:3.1:testCompile (default-testCompile) @ zksy-admin ---
  186. [INFO] Changes detected - recompiling the module!
  187. [INFO] Compiling 67 source files to E:\pipe-ner-server\pipe-network-service\zksy-admin\target\test-classes
  188. [WARNING] /E:/pipe-ner-server/pipe-network-service/zksy-admin/src/test/java/com/zksy/web/controller/cockpit/BusinessCockpitOverviewWarningSettingsAdapterTest.java: 某些输入文件使用了未经检查或不安全的操作。
  189. [WARNING] /E:/pipe-ner-server/pipe-network-service/zksy-admin/src/test/java/com/zksy/web/controller/cockpit/BusinessCockpitOverviewWarningSettingsAdapterTest.java: 有关详细信息, 请使用 -Xlint:unchecked 重新编译。
  190. [INFO]
  191. [INFO] --- surefire:2.22.2:test (default-test) @ zksy-admin ---
  192. [INFO]
  193. [INFO] -------------------------------------------------------
  194. [INFO] T E S T S
  195. [INFO] -------------------------------------------------------
  196. [INFO] Running com.zksy.web.controller.cockpit.CockpitFacilityGeometryControllerTest
  197. 17:12:01.891 [main] DEBUG org.jboss.logging - Logging Provider: org.jboss.logging.Log4j2LoggerProvider
  198. 17:12:01.893 [main] INFO org.hibernate.validator.internal.util.Version - HV000001: Hibernate Validator 6.2.5.Final
  199. 17:12:01.908 [main] DEBUG org.hibernate.validator.messageinterpolation.ResourceBundleMessageInterpolator - Loaded expression factory via original TCCL
  200. 17:12:01.909 [main] DEBUG org.hibernate.validator.internal.engine.AbstractConfigurationImpl - Setting custom MessageInterpolator of type org.springframework.validation.beanvalidation.LocaleContextMessageInterpolator
  201. 17:12:01.909 [main] DEBUG org.hibernate.validator.internal.engine.AbstractConfigurationImpl - Setting custom ParameterNameProvider of type org.springframework.validation.beanvalidation.LocalValidatorFactoryBean$1
  202. 17:12:01.911 [main] DEBUG org.hibernate.validator.internal.xml.config.ValidationXmlParser - Trying to load META-INF/validation.xml for XML based Validator configuration.
  203. 17:12:01.912 [main] DEBUG org.hibernate.validator.internal.xml.config.ResourceLoaderHelper - Trying to load META-INF/validation.xml via TCCL
  204. 17:12:01.912 [main] DEBUG org.hibernate.validator.internal.xml.config.ResourceLoaderHelper - Trying to load META-INF/validation.xml via Hibernate Validator's class loader
  205. 17:12:01.912 [main] DEBUG org.hibernate.validator.internal.xml.config.ValidationXmlParser - No META-INF/validation.xml found. Using annotation based configuration only.
  206. 17:12:01.915 [main] DEBUG org.hibernate.validator.internal.engine.resolver.TraversableResolvers - Cannot find javax.persistence.Persistence on classpath. Assuming non JPA 2 environment. All properties will per default be traversable.
  207. 17:12:01.987 [main] DEBUG org.hibernate.validator.internal.engine.ValidatorFactoryConfigurationHelper - HV000252: Using org.hibernate.validator.internal.engine.DefaultPropertyNodeNameProvider as property node name provider.
  208. 17:12:01.993 [main] DEBUG org.hibernate.validator.internal.engine.ValidatorFactoryConfigurationHelper - HV000234: Using org.springframework.validation.beanvalidation.LocaleContextMessageInterpolator as ValidatorFactory-scoped message interpolator.
  209. 17:12:01.993 [main] DEBUG org.hibernate.validator.internal.engine.ValidatorFactoryConfigurationHelper - HV000234: Using org.hibernate.validator.internal.engine.resolver.TraverseAllTraversableResolver as ValidatorFactory-scoped traversable resolver.
  210. 17:12:01.993 [main] DEBUG org.hibernate.validator.internal.engine.ValidatorFactoryConfigurationHelper - HV000234: Using org.hibernate.validator.internal.util.ExecutableParameterNameProvider as ValidatorFactory-scoped parameter name provider.
  211. 17:12:01.993 [main] DEBUG org.hibernate.validator.internal.engine.ValidatorFactoryConfigurationHelper - HV000234: Using org.hibernate.validator.internal.engine.DefaultClockProvider as ValidatorFactory-scoped clock provider.
  212. 17:12:01.993 [main] DEBUG org.hibernate.validator.internal.engine.ValidatorFactoryConfigurationHelper - HV000234: Using org.hibernate.validator.internal.engine.scripting.DefaultScriptEvaluatorFactory as ValidatorFactory-scoped script evaluator factory.
  213. 17:12:02.067 [main] DEBUG _org.springframework.web.servlet.HandlerMapping.Mappings -
  214. c.z.w.c.c.CockpitFacilityGeometryController:
  215. {GET [/api/cockpit/v1/infrastructure/geometry]}: geometry()
  216. 17:12:02.070 [main] DEBUG org.springframework.web.servlet.mvc.method.annotation.RequestMappingHandlerMapping - 1 mappings in org.springframework.web.servlet.mvc.method.annotation.RequestMappingHandlerMapping
  217. 17:12:02.272 [main] DEBUG org.springframework.web.servlet.mvc.method.annotation.RequestMappingHandlerAdapter - ControllerAdvice beans: 0 @ModelAttribute, 0 @InitBinder, 1 RequestBodyAdvice, 1 ResponseBodyAdvice
  218. 17:12:02.294 [main] DEBUG org.springframework.web.servlet.mvc.method.annotation.ExceptionHandlerExceptionResolver - ControllerAdvice beans: 0 @ExceptionHandler, 1 ResponseBodyAdvice
  219. 17:12:02.312 [main] INFO org.springframework.mock.web.MockServletContext - Initializing Spring TestDispatcherServlet ''
  220. 17:12:02.312 [main] INFO org.springframework.test.web.servlet.TestDispatcherServlet - Initializing Servlet ''
  221. 17:12:02.314 [main] DEBUG org.springframework.test.web.servlet.TestDispatcherServlet - Detected AcceptHeaderLocaleResolver
  222. 17:12:02.314 [main] DEBUG org.springframework.test.web.servlet.TestDispatcherServlet - Detected FixedThemeResolver
  223. 17:12:02.314 [main] DEBUG org.springframework.test.web.servlet.TestDispatcherServlet - Detected org.springframework.web.servlet.view.DefaultRequestToViewNameTranslator@4462efe1
  224. 17:12:02.314 [main] DEBUG org.springframework.test.web.servlet.TestDispatcherServlet - Detected org.springframework.web.servlet.support.SessionFlashMapManager@7c3e4b1a
  225. 17:12:02.314 [main] DEBUG org.springframework.test.web.servlet.TestDispatcherServlet - enableLoggingRequestDetails='false': request parameters and headers will be masked to prevent unsafe logging of potentially sensitive data
  226. 17:12:02.314 [main] INFO org.springframework.test.web.servlet.TestDispatcherServlet - Completed initialization in 2 ms
  227. 17:12:02.582 [main] DEBUG org.springframework.test.web.servlet.TestDispatcherServlet - GET "/api/cockpit/v1/infrastructure/geometry", parameters={}
  228. 17:12:02.585 [main] DEBUG org.springframework.web.servlet.mvc.method.annotation.RequestMappingHandlerMapping - Mapped to com.zksy.web.controller.cockpit.CockpitFacilityGeometryController#geometry()
  229. 17:12:02.619 [main] DEBUG org.springframework.web.servlet.mvc.method.annotation.HttpEntityMethodProcessor - Using 'application/json', given [*/*] and supported [application/json, application/*+json]
  230. 17:12:02.620 [main] DEBUG org.springframework.web.servlet.mvc.method.annotation.HttpEntityMethodProcessor - Writing [{msg=操作成功, code=200, data=com.zksy.cockpit.geometry.CockpitFacilityGeometryResponse@2c3158e0}]
  231. 17:12:02.638 [main] DEBUG org.springframework.test.web.servlet.TestDispatcherServlet - Completed 200 OK
  232. 17:12:02.670 [main] DEBUG com.jayway.jsonpath.internal.path.CompiledPath - Evaluating path: $['code']
  233. 17:12:02.675 [main] DEBUG com.jayway.jsonpath.internal.path.CompiledPath - Evaluating path: $['data']['type']
  234. 17:12:02.678 [main] DEBUG com.jayway.jsonpath.internal.path.CompiledPath - Evaluating path: $['data']['features']
  235. 17:12:02.678 [main] DEBUG com.jayway.jsonpath.internal.path.CompiledPath - Evaluating path: $['data']['coverage']
  236. 17:12:02.679 [main] DEBUG com.jayway.jsonpath.internal.path.CompiledPath - Evaluating path: $['data']['coverage'][4]['state']
  237. 17:12:02.684 [main] DEBUG org.hibernate.validator.messageinterpolation.ResourceBundleMessageInterpolator - Loaded expression factory via original TCCL
  238. 17:12:02.684 [main] DEBUG org.hibernate.validator.internal.engine.AbstractConfigurationImpl - Setting custom MessageInterpolator of type org.springframework.validation.beanvalidation.LocaleContextMessageInterpolator
  239. 17:12:02.684 [main] DEBUG org.hibernate.validator.internal.engine.AbstractConfigurationImpl - Setting custom ParameterNameProvider of type org.springframework.validation.beanvalidation.LocalValidatorFactoryBean$1
  240. 17:12:02.684 [main] DEBUG org.hibernate.validator.internal.xml.config.ValidationXmlParser - Trying to load META-INF/validation.xml for XML based Validator configuration.
  241. 17:12:02.684 [main] DEBUG org.hibernate.validator.internal.xml.config.ResourceLoaderHelper - Trying to load META-INF/validation.xml via TCCL
  242. 17:12:02.684 [main] DEBUG org.hibernate.validator.internal.xml.config.ResourceLoaderHelper - Trying to load META-INF/validation.xml via Hibernate Validator's class loader
  243. 17:12:02.684 [main] DEBUG org.hibernate.validator.internal.xml.config.ValidationXmlParser - No META-INF/validation.xml found. Using annotation based configuration only.
  244. 17:12:02.685 [main] DEBUG org.hibernate.validator.internal.engine.resolver.TraversableResolvers - Cannot find javax.persistence.Persistence on classpath. Assuming non JPA 2 environment. All properties will per default be traversable.
  245. 17:12:02.686 [main] DEBUG org.hibernate.validator.internal.engine.ValidatorFactoryConfigurationHelper - HV000252: Using org.hibernate.validator.internal.engine.DefaultPropertyNodeNameProvider as property node name provider.
  246. 17:12:02.686 [main] DEBUG org.hibernate.validator.internal.engine.ValidatorFactoryConfigurationHelper - HV000234: Using org.springframework.validation.beanvalidation.LocaleContextMessageInterpolator as ValidatorFactory-scoped message interpolator.
  247. 17:12:02.686 [main] DEBUG org.hibernate.validator.internal.engine.ValidatorFactoryConfigurationHelper - HV000234: Using org.hibernate.validator.internal.engine.resolver.TraverseAllTraversableResolver as ValidatorFactory-scoped traversable resolver.
  248. 17:12:02.686 [main] DEBUG org.hibernate.validator.internal.engine.ValidatorFactoryConfigurationHelper - HV000234: Using org.hibernate.validator.internal.util.ExecutableParameterNameProvider as ValidatorFactory-scoped parameter name provider.
  249. 17:12:02.686 [main] DEBUG org.hibernate.validator.internal.engine.ValidatorFactoryConfigurationHelper - HV000234: Using org.hibernate.validator.internal.engine.DefaultClockProvider as ValidatorFactory-scoped clock provider.
  250. 17:12:02.686 [main] DEBUG org.hibernate.validator.internal.engine.ValidatorFactoryConfigurationHelper - HV000234: Using org.hibernate.validator.internal.engine.scripting.DefaultScriptEvaluatorFactory as ValidatorFactory-scoped script evaluator factory.
  251. 17:12:02.688 [main] DEBUG _org.springframework.web.servlet.HandlerMapping.Mappings -
  252. c.z.w.c.c.CockpitFacilityGeometryController:
  253. {GET [/api/cockpit/v1/infrastructure/geometry]}: geometry()
  254. 17:12:02.688 [main] DEBUG org.springframework.web.servlet.mvc.method.annotation.RequestMappingHandlerMapping - 1 mappings in org.springframework.web.servlet.mvc.method.annotation.RequestMappingHandlerMapping
  255. 17:12:02.693 [main] DEBUG org.springframework.web.servlet.mvc.method.annotation.RequestMappingHandlerAdapter - ControllerAdvice beans: 0 @ModelAttribute, 0 @InitBinder, 1 RequestBodyAdvice, 1 ResponseBodyAdvice
  256. 17:12:02.694 [main] DEBUG org.springframework.web.servlet.mvc.method.annotation.ExceptionHandlerExceptionResolver - ControllerAdvice beans: 0 @ExceptionHandler, 1 ResponseBodyAdvice
  257. 17:12:02.694 [main] INFO org.springframework.mock.web.MockServletContext - Initializing Spring TestDispatcherServlet ''
  258. 17:12:02.694 [main] INFO org.springframework.test.web.servlet.TestDispatcherServlet - Initializing Servlet ''
  259. 17:12:02.694 [main] DEBUG org.springframework.test.web.servlet.TestDispatcherServlet - Detected AcceptHeaderLocaleResolver
  260. 17:12:02.694 [main] DEBUG org.springframework.test.web.servlet.TestDispatcherServlet - Detected FixedThemeResolver
  261. 17:12:02.694 [main] DEBUG org.springframework.test.web.servlet.TestDispatcherServlet - Detected org.springframework.web.servlet.view.DefaultRequestToViewNameTranslator@526f6427
  262. 17:12:02.694 [main] DEBUG org.springframework.test.web.servlet.TestDispatcherServlet - Detected org.springframework.web.servlet.support.SessionFlashMapManager@4f1afe8f
  263. 17:12:02.694 [main] DEBUG org.springframework.test.web.servlet.TestDispatcherServlet - enableLoggingRequestDetails='false': request parameters and headers will be masked to prevent unsafe logging of potentially sensitive data
  264. 17:12:02.694 [main] INFO org.springframework.test.web.servlet.TestDispatcherServlet - Completed initialization in 0 ms
  265. 17:12:02.695 [main] DEBUG org.springframework.test.web.servlet.TestDispatcherServlet - GET "/api/cockpit/v1/infrastructure/geometry", parameters={}
  266. 17:12:02.695 [main] DEBUG org.springframework.web.servlet.mvc.method.annotation.RequestMappingHandlerMapping - Mapped to com.zksy.web.controller.cockpit.CockpitFacilityGeometryController#geometry()
  267. 17:12:02.696 [main] DEBUG org.springframework.web.servlet.mvc.method.annotation.HttpEntityMethodProcessor - Using 'application/json', given [*/*] and supported [application/json, application/*+json]
  268. 17:12:02.696 [main] DEBUG org.springframework.web.servlet.mvc.method.annotation.HttpEntityMethodProcessor - Writing [{msg=操作成功, code=200, data=com.zksy.cockpit.geometry.CockpitFacilityGeometryResponse@752b69e3}]
  269. 17:12:02.704 [main] DEBUG org.springframework.test.web.servlet.TestDispatcherServlet - Completed 200 OK
  270. 17:12:02.705 [main] DEBUG com.jayway.jsonpath.internal.path.CompiledPath - Evaluating path: $['data']['features'][0]['type']
  271. 17:12:02.705 [main] DEBUG com.jayway.jsonpath.internal.path.CompiledPath - Evaluating path: $['data']['features'][0]['geometry']
  272. 17:12:02.706 [main] DEBUG com.jayway.jsonpath.internal.path.CompiledPath - Evaluating path: $['data']['features'][0]['properties']['networkId']
  273. 17:12:02.706 [main] DEBUG com.jayway.jsonpath.internal.path.CompiledPath - Evaluating path: $['data']['features'][0]['properties']['pointType']
  274. 17:12:02.706 [main] DEBUG com.jayway.jsonpath.internal.path.CompiledPath - Evaluating path: $['data']['features'][0]['properties']['sourceCoordinates'][0][0]
  275. 17:12:02.706 [main] DEBUG com.jayway.jsonpath.internal.path.CompiledPath - Evaluating path: $['data']['features'][0]['properties']['coordinateValidation']['state']
  276. 17:12:02.707 [main] DEBUG com.jayway.jsonpath.internal.path.CompiledPath - Evaluating path: $['data']['features'][0]['properties']['coordinateValidation']['reason']
  277. 17:12:02.707 [main] DEBUG com.jayway.jsonpath.internal.path.CompiledPath - Evaluating path: $['data']['features'][0]['properties']['coordinateValidation']['renderable']
  278. 17:12:02.707 [main] DEBUG com.jayway.jsonpath.internal.path.CompiledPath - Evaluating path: $['data']['features'][0]['properties']['coordinateValidation']['crs']
  279. 17:12:02.709 [main] DEBUG org.hibernate.validator.messageinterpolation.ResourceBundleMessageInterpolator - Loaded expression factory via original TCCL
  280. 17:12:02.709 [main] DEBUG org.hibernate.validator.internal.engine.AbstractConfigurationImpl - Setting custom MessageInterpolator of type org.springframework.validation.beanvalidation.LocaleContextMessageInterpolator
  281. 17:12:02.709 [main] DEBUG org.hibernate.validator.internal.engine.AbstractConfigurationImpl - Setting custom ParameterNameProvider of type org.springframework.validation.beanvalidation.LocalValidatorFactoryBean$1
  282. 17:12:02.709 [main] DEBUG org.hibernate.validator.internal.xml.config.ValidationXmlParser - Trying to load META-INF/validation.xml for XML based Validator configuration.
  283. 17:12:02.709 [main] DEBUG org.hibernate.validator.internal.xml.config.ResourceLoaderHelper - Trying to load META-INF/validation.xml via TCCL
  284. 17:12:02.709 [main] DEBUG org.hibernate.validator.internal.xml.config.ResourceLoaderHelper - Trying to load META-INF/validation.xml via Hibernate Validator's class loader
  285. 17:12:02.710 [main] DEBUG org.hibernate.validator.internal.xml.config.ValidationXmlParser - No META-INF/validation.xml found. Using annotation based configuration only.
  286. 17:12:02.710 [main] DEBUG org.hibernate.validator.internal.engine.resolver.TraversableResolvers - Cannot find javax.persistence.Persistence on classpath. Assuming non JPA 2 environment. All properties will per default be traversable.
  287. 17:12:02.711 [main] DEBUG org.hibernate.validator.internal.engine.ValidatorFactoryConfigurationHelper - HV000252: Using org.hibernate.validator.internal.engine.DefaultPropertyNodeNameProvider as property node name provider.
  288. 17:12:02.711 [main] DEBUG org.hibernate.validator.internal.engine.ValidatorFactoryConfigurationHelper - HV000234: Using org.springframework.validation.beanvalidation.LocaleContextMessageInterpolator as ValidatorFactory-scoped message interpolator.
  289. 17:12:02.711 [main] DEBUG org.hibernate.validator.internal.engine.ValidatorFactoryConfigurationHelper - HV000234: Using org.hibernate.validator.internal.engine.resolver.TraverseAllTraversableResolver as ValidatorFactory-scoped traversable resolver.
  290. 17:12:02.711 [main] DEBUG org.hibernate.validator.internal.engine.ValidatorFactoryConfigurationHelper - HV000234: Using org.hibernate.validator.internal.util.ExecutableParameterNameProvider as ValidatorFactory-scoped parameter name provider.
  291. 17:12:02.711 [main] DEBUG org.hibernate.validator.internal.engine.ValidatorFactoryConfigurationHelper - HV000234: Using org.hibernate.validator.internal.engine.DefaultClockProvider as ValidatorFactory-scoped clock provider.
  292. 17:12:02.711 [main] DEBUG org.hibernate.validator.internal.engine.ValidatorFactoryConfigurationHelper - HV000234: Using org.hibernate.validator.internal.engine.scripting.DefaultScriptEvaluatorFactory as ValidatorFactory-scoped script evaluator factory.
  293. 17:12:02.712 [main] DEBUG _org.springframework.web.servlet.HandlerMapping.Mappings -
  294. c.z.w.c.c.CockpitFacilityGeometryController:
  295. {GET [/api/cockpit/v1/infrastructure/geometry]}: geometry()
  296. 17:12:02.712 [main] DEBUG org.springframework.web.servlet.mvc.method.annotation.RequestMappingHandlerMapping - 1 mappings in org.springframework.web.servlet.mvc.method.annotation.RequestMappingHandlerMapping
  297. 17:12:02.715 [main] DEBUG org.springframework.web.servlet.mvc.method.annotation.RequestMappingHandlerAdapter - ControllerAdvice beans: 0 @ModelAttribute, 0 @InitBinder, 1 RequestBodyAdvice, 1 ResponseBodyAdvice
  298. 17:12:02.716 [main] DEBUG org.springframework.web.servlet.mvc.method.annotation.ExceptionHandlerExceptionResolver - ControllerAdvice beans: 0 @ExceptionHandler, 1 ResponseBodyAdvice
  299. 17:12:02.716 [main] INFO org.springframework.mock.web.MockServletContext - Initializing Spring TestDispatcherServlet ''
  300. 17:12:02.716 [main] INFO org.springframework.test.web.servlet.TestDispatcherServlet - Initializing Servlet ''
  301. 17:12:02.716 [main] DEBUG org.springframework.test.web.servlet.TestDispatcherServlet - Detected AcceptHeaderLocaleResolver
  302. 17:12:02.716 [main] DEBUG org.springframework.test.web.servlet.TestDispatcherServlet - Detected FixedThemeResolver
  303. 17:12:02.716 [main] DEBUG org.springframework.test.web.servlet.TestDispatcherServlet - Detected org.springframework.web.servlet.view.DefaultRequestToViewNameTranslator@48d739f
  304. 17:12:02.716 [main] DEBUG org.springframework.test.web.servlet.TestDispatcherServlet - Detected org.springframework.web.servlet.support.SessionFlashMapManager@51e7589f
  305. 17:12:02.716 [main] DEBUG org.springframework.test.web.servlet.TestDispatcherServlet - enableLoggingRequestDetails='false': request parameters and headers will be masked to prevent unsafe logging of potentially sensitive data
  306. 17:12:02.716 [main] INFO org.springframework.test.web.servlet.TestDispatcherServlet - Completed initialization in 0 ms
  307. 17:12:02.716 [main] DEBUG org.springframework.test.web.servlet.TestDispatcherServlet - POST "/api/cockpit/v1/infrastructure/geometry", parameters={}
  308. 17:12:02.717 [main] WARN org.springframework.web.servlet.mvc.support.DefaultHandlerExceptionResolver - Resolved [org.springframework.web.HttpRequestMethodNotSupportedException: Request method 'POST' not supported]
  309. 17:12:02.717 [main] DEBUG org.springframework.test.web.servlet.TestDispatcherServlet - Completed 405 METHOD_NOT_ALLOWED
  310. 17:12:02.720 [main] DEBUG org.hibernate.validator.messageinterpolation.ResourceBundleMessageInterpolator - Loaded expression factory via original TCCL
  311. 17:12:02.721 [main] DEBUG org.hibernate.validator.internal.engine.AbstractConfigurationImpl - Setting custom MessageInterpolator of type org.springframework.validation.beanvalidation.LocaleContextMessageInterpolator
  312. 17:12:02.721 [main] DEBUG org.hibernate.validator.internal.engine.AbstractConfigurationImpl - Setting custom ParameterNameProvider of type org.springframework.validation.beanvalidation.LocalValidatorFactoryBean$1
  313. 17:12:02.721 [main] DEBUG org.hibernate.validator.internal.xml.config.ValidationXmlParser - Trying to load META-INF/validation.xml for XML based Validator configuration.
  314. 17:12:02.721 [main] DEBUG org.hibernate.validator.internal.xml.config.ResourceLoaderHelper - Trying to load META-INF/validation.xml via TCCL
  315. 17:12:02.722 [main] DEBUG org.hibernate.validator.internal.xml.config.ResourceLoaderHelper - Trying to load META-INF/validation.xml via Hibernate Validator's class loader
  316. 17:12:02.722 [main] DEBUG org.hibernate.validator.internal.xml.config.ValidationXmlParser - No META-INF/validation.xml found. Using annotation based configuration only.
  317. 17:12:02.722 [main] DEBUG org.hibernate.validator.internal.engine.resolver.TraversableResolvers - Cannot find javax.persistence.Persistence on classpath. Assuming non JPA 2 environment. All properties will per default be traversable.
  318. 17:12:02.723 [main] DEBUG org.hibernate.validator.internal.engine.ValidatorFactoryConfigurationHelper - HV000252: Using org.hibernate.validator.internal.engine.DefaultPropertyNodeNameProvider as property node name provider.
  319. 17:12:02.723 [main] DEBUG org.hibernate.validator.internal.engine.ValidatorFactoryConfigurationHelper - HV000234: Using org.springframework.validation.beanvalidation.LocaleContextMessageInterpolator as ValidatorFactory-scoped message interpolator.
  320. 17:12:02.723 [main] DEBUG org.hibernate.validator.internal.engine.ValidatorFactoryConfigurationHelper - HV000234: Using org.hibernate.validator.internal.engine.resolver.TraverseAllTraversableResolver as ValidatorFactory-scoped traversable resolver.
  321. 17:12:02.723 [main] DEBUG org.hibernate.validator.internal.engine.ValidatorFactoryConfigurationHelper - HV000234: Using org.hibernate.validator.internal.util.ExecutableParameterNameProvider as ValidatorFactory-scoped parameter name provider.
  322. 17:12:02.723 [main] DEBUG org.hibernate.validator.internal.engine.ValidatorFactoryConfigurationHelper - HV000234: Using org.hibernate.validator.internal.engine.DefaultClockProvider as ValidatorFactory-scoped clock provider.
  323. 17:12:02.723 [main] DEBUG org.hibernate.validator.internal.engine.ValidatorFactoryConfigurationHelper - HV000234: Using org.hibernate.validator.internal.engine.scripting.DefaultScriptEvaluatorFactory as ValidatorFactory-scoped script evaluator factory.
  324. 17:12:02.724 [main] DEBUG _org.springframework.web.servlet.HandlerMapping.Mappings -
  325. c.z.w.c.c.CockpitFacilityGeometryController:
  326. {GET [/api/cockpit/v1/infrastructure/geometry]}: geometry()
  327. 17:12:02.725 [main] DEBUG org.springframework.web.servlet.mvc.method.annotation.RequestMappingHandlerMapping - 1 mappings in org.springframework.web.servlet.mvc.method.annotation.RequestMappingHandlerMapping
  328. 17:12:02.727 [main] DEBUG org.springframework.web.servlet.mvc.method.annotation.RequestMappingHandlerAdapter - ControllerAdvice beans: 0 @ModelAttribute, 0 @InitBinder, 1 RequestBodyAdvice, 1 ResponseBodyAdvice
  329. 17:12:02.729 [main] DEBUG org.springframework.web.servlet.mvc.method.annotation.ExceptionHandlerExceptionResolver - ControllerAdvice beans: 0 @ExceptionHandler, 1 ResponseBodyAdvice
  330. 17:12:02.729 [main] INFO org.springframework.mock.web.MockServletContext - Initializing Spring TestDispatcherServlet ''
  331. 17:12:02.729 [main] INFO org.springframework.test.web.servlet.TestDispatcherServlet - Initializing Servlet ''
  332. 17:12:02.729 [main] DEBUG org.springframework.test.web.servlet.TestDispatcherServlet - Detected AcceptHeaderLocaleResolver
  333. 17:12:02.729 [main] DEBUG org.springframework.test.web.servlet.TestDispatcherServlet - Detected FixedThemeResolver
  334. 17:12:02.729 [main] DEBUG org.springframework.test.web.servlet.TestDispatcherServlet - Detected org.springframework.web.servlet.view.DefaultRequestToViewNameTranslator@7b9088f2
  335. 17:12:02.729 [main] DEBUG org.springframework.test.web.servlet.TestDispatcherServlet - Detected org.springframework.web.servlet.support.SessionFlashMapManager@1a914089
  336. 17:12:02.729 [main] DEBUG org.springframework.test.web.servlet.TestDispatcherServlet - enableLoggingRequestDetails='false': request parameters and headers will be masked to prevent unsafe logging of potentially sensitive data
  337. 17:12:02.729 [main] INFO org.springframework.test.web.servlet.TestDispatcherServlet - Completed initialization in 0 ms
  338. 17:12:02.731 [main] DEBUG org.hibernate.validator.messageinterpolation.ResourceBundleMessageInterpolator - Loaded expression factory via original TCCL
  339. 17:12:02.731 [main] DEBUG org.hibernate.validator.internal.engine.AbstractConfigurationImpl - Setting custom MessageInterpolator of type org.springframework.validation.beanvalidation.LocaleContextMessageInterpolator
  340. 17:12:02.731 [main] DEBUG org.hibernate.validator.internal.engine.AbstractConfigurationImpl - Setting custom ParameterNameProvider of type org.springframework.validation.beanvalidation.LocalValidatorFactoryBean$1
  341. 17:12:02.731 [main] DEBUG org.hibernate.validator.internal.xml.config.ValidationXmlParser - Trying to load META-INF/validation.xml for XML based Validator configuration.
  342. 17:12:02.731 [main] DEBUG org.hibernate.validator.internal.xml.config.ResourceLoaderHelper - Trying to load META-INF/validation.xml via TCCL
  343. 17:12:02.731 [main] DEBUG org.hibernate.validator.internal.xml.config.ResourceLoaderHelper - Trying to load META-INF/validation.xml via Hibernate Validator's class loader
  344. 17:12:02.731 [main] DEBUG org.hibernate.validator.internal.xml.config.ValidationXmlParser - No META-INF/validation.xml found. Using annotation based configuration only.
  345. 17:12:02.731 [main] DEBUG org.hibernate.validator.internal.engine.resolver.TraversableResolvers - Cannot find javax.persistence.Persistence on classpath. Assuming non JPA 2 environment. All properties will per default be traversable.
  346. 17:12:02.732 [main] DEBUG org.hibernate.validator.internal.engine.ValidatorFactoryConfigurationHelper - HV000252: Using org.hibernate.validator.internal.engine.DefaultPropertyNodeNameProvider as property node name provider.
  347. 17:12:02.732 [main] DEBUG org.hibernate.validator.internal.engine.ValidatorFactoryConfigurationHelper - HV000234: Using org.springframework.validation.beanvalidation.LocaleContextMessageInterpolator as ValidatorFactory-scoped message interpolator.
  348. 17:12:02.732 [main] DEBUG org.hibernate.validator.internal.engine.ValidatorFactoryConfigurationHelper - HV000234: Using org.hibernate.validator.internal.engine.resolver.TraverseAllTraversableResolver as ValidatorFactory-scoped traversable resolver.
  349. 17:12:02.732 [main] DEBUG org.hibernate.validator.internal.engine.ValidatorFactoryConfigurationHelper - HV000234: Using org.hibernate.validator.internal.util.ExecutableParameterNameProvider as ValidatorFactory-scoped parameter name provider.
  350. 17:12:02.732 [main] DEBUG org.hibernate.validator.internal.engine.ValidatorFactoryConfigurationHelper - HV000234: Using org.hibernate.validator.internal.engine.DefaultClockProvider as ValidatorFactory-scoped clock provider.
  351. 17:12:02.732 [main] DEBUG org.hibernate.validator.internal.engine.ValidatorFactoryConfigurationHelper - HV000234: Using org.hibernate.validator.internal.engine.scripting.DefaultScriptEvaluatorFactory as ValidatorFactory-scoped script evaluator factory.
  352. 17:12:02.733 [main] DEBUG _org.springframework.web.servlet.HandlerMapping.Mappings -
  353. c.z.w.c.c.CockpitFacilityGeometryController:
  354. {GET [/api/cockpit/v1/infrastructure/geometry]}: geometry()
  355. 17:12:02.733 [main] DEBUG org.springframework.web.servlet.mvc.method.annotation.RequestMappingHandlerMapping - 1 mappings in org.springframework.web.servlet.mvc.method.annotation.RequestMappingHandlerMapping
  356. 17:12:02.737 [main] DEBUG org.springframework.web.servlet.mvc.method.annotation.RequestMappingHandlerAdapter - ControllerAdvice beans: 0 @ModelAttribute, 0 @InitBinder, 1 RequestBodyAdvice, 1 ResponseBodyAdvice
  357. 17:12:02.740 [main] DEBUG org.springframework.web.servlet.mvc.method.annotation.ExceptionHandlerExceptionResolver - ControllerAdvice beans: 0 @ExceptionHandler, 1 ResponseBodyAdvice
  358. 17:12:02.740 [main] INFO org.springframework.mock.web.MockServletContext - Initializing Spring TestDispatcherServlet ''
  359. 17:12:02.740 [main] INFO org.springframework.test.web.servlet.TestDispatcherServlet - Initializing Servlet ''
  360. 17:12:02.740 [main] DEBUG org.springframework.test.web.servlet.TestDispatcherServlet - Detected AcceptHeaderLocaleResolver
  361. 17:12:02.740 [main] DEBUG org.springframework.test.web.servlet.TestDispatcherServlet - Detected FixedThemeResolver
  362. 17:12:02.740 [main] DEBUG org.springframework.test.web.servlet.TestDispatcherServlet - Detected org.springframework.web.servlet.view.DefaultRequestToViewNameTranslator@79df80a4
  363. 17:12:02.740 [main] DEBUG org.springframework.test.web.servlet.TestDispatcherServlet - Detected org.springframework.web.servlet.support.SessionFlashMapManager@130cfc47
  364. 17:12:02.740 [main] DEBUG org.springframework.test.web.servlet.TestDispatcherServlet - enableLoggingRequestDetails='false': request parameters and headers will be masked to prevent unsafe logging of potentially sensitive data
  365. 17:12:02.740 [main] INFO org.springframework.test.web.servlet.TestDispatcherServlet - Completed initialization in 0 ms
  366. 17:12:02.740 [main] DEBUG org.springframework.test.web.servlet.TestDispatcherServlet - GET "/api/cockpit/v1/infrastructure/geometry", parameters={}
  367. 17:12:02.741 [main] DEBUG org.springframework.web.servlet.mvc.method.annotation.RequestMappingHandlerMapping - Mapped to com.zksy.web.controller.cockpit.CockpitFacilityGeometryController#geometry()
  368. 17:12:02.744 [main] DEBUG org.springframework.web.servlet.mvc.method.annotation.HttpEntityMethodProcessor - Using 'application/json', given [*/*] and supported [application/json, application/*+json]
  369. 17:12:02.744 [main] DEBUG org.springframework.web.servlet.mvc.method.annotation.HttpEntityMethodProcessor - Writing [{msg=操作成功, code=200, data=com.zksy.cockpit.geometry.CockpitFacilityGeometryResponse@787988f4}]
  370. 17:12:02.750 [main] DEBUG org.springframework.test.web.servlet.TestDispatcherServlet - Completed 200 OK
  371. 17:12:02.751 [main] DEBUG com.jayway.jsonpath.internal.path.CompiledPath - Evaluating path: $['data']['features']
  372. 17:12:02.751 [main] DEBUG com.jayway.jsonpath.internal.path.CompiledPath - Evaluating path: $['data']['features'][0]['geometry']['type']
  373. 17:12:02.751 [main] DEBUG com.jayway.jsonpath.internal.path.CompiledPath - Evaluating path: $['data']['features'][0]['properties']['diameter']
  374. 17:12:02.751 [main] DEBUG com.jayway.jsonpath.internal.path.CompiledPath - Evaluating path: $['data']['features'][1]['properties']['diameter']
  375. 17:12:02.751 [main] DEBUG com.jayway.jsonpath.internal.path.CompiledPath - Evaluating path: $['data']['features'][0]['geometry']['coordinates']
  376. 17:12:02.752 [main] DEBUG com.jayway.jsonpath.internal.path.CompiledPath - Evaluating path: $['data']['features'][0]['geometry']['coordinates'][0][0]
  377. 17:12:02.752 [main] DEBUG com.jayway.jsonpath.internal.path.CompiledPath - Evaluating path: $['data']['features'][0]['geometry']['coordinates'][0][1]
  378. 17:12:02.752 [main] DEBUG com.jayway.jsonpath.internal.path.CompiledPath - Evaluating path: $['data']['features'][0]['geometry']['coordinates'][1][0]
  379. 17:12:02.753 [main] DEBUG com.jayway.jsonpath.internal.path.CompiledPath - Evaluating path: $['data']['features'][0]['geometry']['coordinates'][1][1]
  380. 17:12:02.754 [main] DEBUG com.jayway.jsonpath.internal.path.CompiledPath - Evaluating path: $['data']['features'][1]['geometry']['type']
  381. 17:12:02.755 [main] DEBUG com.jayway.jsonpath.internal.path.CompiledPath - Evaluating path: $['data']['features'][1]['geometry']['coordinates']
  382. 17:12:02.756 [main] DEBUG com.jayway.jsonpath.internal.path.CompiledPath - Evaluating path: $['data']['features'][1]['geometry']['coordinates'][0]
  383. 17:12:02.756 [main] DEBUG com.jayway.jsonpath.internal.path.CompiledPath - Evaluating path: $['data']['features'][1]['geometry']['coordinates'][1]
  384. 17:12:02.756 [main] DEBUG com.jayway.jsonpath.internal.path.CompiledPath - Evaluating path: $['data']['features'][1]['properties']['pointType']
  385. 17:12:02.757 [main] DEBUG com.jayway.jsonpath.internal.path.CompiledPath - Evaluating path: $['data']['features'][1]['properties']['networkId']
  386. 17:12:02.758 [main] DEBUG com.jayway.jsonpath.internal.path.CompiledPath - Evaluating path: $['data']['features'][1]['properties']['coordinateValidation']['state']
  387. 17:12:02.758 [main] DEBUG com.jayway.jsonpath.internal.path.CompiledPath - Evaluating path: $['data']['features'][1]['properties']['coordinateValidation']['renderable']
  388. 17:12:02.760 [main] DEBUG org.hibernate.validator.messageinterpolation.ResourceBundleMessageInterpolator - Loaded expression factory via original TCCL
  389. 17:12:02.760 [main] DEBUG org.hibernate.validator.internal.engine.AbstractConfigurationImpl - Setting custom MessageInterpolator of type org.springframework.validation.beanvalidation.LocaleContextMessageInterpolator
  390. 17:12:02.760 [main] DEBUG org.hibernate.validator.internal.engine.AbstractConfigurationImpl - Setting custom ParameterNameProvider of type org.springframework.validation.beanvalidation.LocalValidatorFactoryBean$1
  391. 17:12:02.760 [main] DEBUG org.hibernate.validator.internal.xml.config.ValidationXmlParser - Trying to load META-INF/validation.xml for XML based Validator configuration.
  392. 17:12:02.760 [main] DEBUG org.hibernate.validator.internal.xml.config.ResourceLoaderHelper - Trying to load META-INF/validation.xml via TCCL
  393. 17:12:02.760 [main] DEBUG org.hibernate.validator.internal.xml.config.ResourceLoaderHelper - Trying to load META-INF/validation.xml via Hibernate Validator's class loader
  394. 17:12:02.760 [main] DEBUG org.hibernate.validator.internal.xml.config.ValidationXmlParser - No META-INF/validation.xml found. Using annotation based configuration only.
  395. 17:12:02.761 [main] DEBUG org.hibernate.validator.internal.engine.resolver.TraversableResolvers - Cannot find javax.persistence.Persistence on classpath. Assuming non JPA 2 environment. All properties will per default be traversable.
  396. 17:12:02.762 [main] DEBUG org.hibernate.validator.internal.engine.ValidatorFactoryConfigurationHelper - HV000252: Using org.hibernate.validator.internal.engine.DefaultPropertyNodeNameProvider as property node name provider.
  397. 17:12:02.762 [main] DEBUG org.hibernate.validator.internal.engine.ValidatorFactoryConfigurationHelper - HV000234: Using org.springframework.validation.beanvalidation.LocaleContextMessageInterpolator as ValidatorFactory-scoped message interpolator.
  398. 17:12:02.762 [main] DEBUG org.hibernate.validator.internal.engine.ValidatorFactoryConfigurationHelper - HV000234: Using org.hibernate.validator.internal.engine.resolver.TraverseAllTraversableResolver as ValidatorFactory-scoped traversable resolver.
  399. 17:12:02.762 [main] DEBUG org.hibernate.validator.internal.engine.ValidatorFactoryConfigurationHelper - HV000234: Using org.hibernate.validator.internal.util.ExecutableParameterNameProvider as ValidatorFactory-scoped parameter name provider.
  400. 17:12:02.762 [main] DEBUG org.hibernate.validator.internal.engine.ValidatorFactoryConfigurationHelper - HV000234: Using org.hibernate.validator.internal.engine.DefaultClockProvider as ValidatorFactory-scoped clock provider.
  401. 17:12:02.762 [main] DEBUG org.hibernate.validator.internal.engine.ValidatorFactoryConfigurationHelper - HV000234: Using org.hibernate.validator.internal.engine.scripting.DefaultScriptEvaluatorFactory as ValidatorFactory-scoped script evaluator factory.
  402. 17:12:02.763 [main] DEBUG _org.springframework.web.servlet.HandlerMapping.Mappings -
  403. c.z.w.c.c.CockpitFacilityGeometryController:
  404. {GET [/api/cockpit/v1/infrastructure/geometry]}: geometry()
  405. 17:12:02.763 [main] DEBUG org.springframework.web.servlet.mvc.method.annotation.RequestMappingHandlerMapping - 1 mappings in org.springframework.web.servlet.mvc.method.annotation.RequestMappingHandlerMapping
  406. 17:12:02.768 [main] DEBUG org.springframework.web.servlet.mvc.method.annotation.RequestMappingHandlerAdapter - ControllerAdvice beans: 0 @ModelAttribute, 0 @InitBinder, 1 RequestBodyAdvice, 1 ResponseBodyAdvice
  407. 17:12:02.769 [main] DEBUG org.springframework.web.servlet.mvc.method.annotation.ExceptionHandlerExceptionResolver - ControllerAdvice beans: 0 @ExceptionHandler, 1 ResponseBodyAdvice
  408. 17:12:02.769 [main] INFO org.springframework.mock.web.MockServletContext - Initializing Spring TestDispatcherServlet ''
  409. 17:12:02.769 [main] INFO org.springframework.test.web.servlet.TestDispatcherServlet - Initializing Servlet ''
  410. 17:12:02.769 [main] DEBUG org.springframework.test.web.servlet.TestDispatcherServlet - Detected AcceptHeaderLocaleResolver
  411. 17:12:02.769 [main] DEBUG org.springframework.test.web.servlet.TestDispatcherServlet - Detected FixedThemeResolver
  412. 17:12:02.769 [main] DEBUG org.springframework.test.web.servlet.TestDispatcherServlet - Detected org.springframework.web.servlet.view.DefaultRequestToViewNameTranslator@27ec8754
  413. 17:12:02.769 [main] DEBUG org.springframework.test.web.servlet.TestDispatcherServlet - Detected org.springframework.web.servlet.support.SessionFlashMapManager@3bbf1c0d
  414. 17:12:02.769 [main] DEBUG org.springframework.test.web.servlet.TestDispatcherServlet - enableLoggingRequestDetails='false': request parameters and headers will be masked to prevent unsafe logging of potentially sensitive data
  415. 17:12:02.769 [main] INFO org.springframework.test.web.servlet.TestDispatcherServlet - Completed initialization in 0 ms
  416. 17:12:02.773 [main] DEBUG org.springframework.test.web.servlet.TestDispatcherServlet - GET "/api/cockpit/v1/infrastructure/geometry", parameters={}
  417. 17:12:02.773 [main] DEBUG org.springframework.web.servlet.mvc.method.annotation.RequestMappingHandlerMapping - Mapped to com.zksy.web.controller.cockpit.CockpitFacilityGeometryController#geometry()
  418. 17:12:02.774 [main] DEBUG org.springframework.web.servlet.mvc.method.annotation.ExceptionHandlerExceptionResolver - Using @ExceptionHandler com.zksy.web.controller.cockpit.CockpitFacilityGeometryController#handleReadFailure(HttpServletRequest, RuntimeException)
  419. 17:12:02.776 [main] ERROR com.zksy.web.controller.cockpit.CockpitFacilityGeometryController - Facility geometry read failed
  420. org.springframework.transaction.CannotCreateTransactionException: private connection detail
  421. at com.zksy.web.controller.cockpit.CockpitFacilityGeometryController.geometry(CockpitFacilityGeometryController.java:31)
  422. at java.base/jdk.internal.reflect.NativeMethodAccessorImpl.invoke0(Native Method)
  423. at java.base/jdk.internal.reflect.NativeMethodAccessorImpl.invoke(NativeMethodAccessorImpl.java:77)
  424. at java.base/jdk.internal.reflect.DelegatingMethodAccessorImpl.invoke(DelegatingMethodAccessorImpl.java:43)
  425. at java.base/java.lang.reflect.Method.invoke(Method.java:568)
  426. at org.springframework.web.method.support.InvocableHandlerMethod.doInvoke(InvocableHandlerMethod.java:205)
  427. at org.springframework.web.method.support.InvocableHandlerMethod.invokeForRequest(InvocableHandlerMethod.java:150)
  428. at org.springframework.web.servlet.mvc.method.annotation.ServletInvocableHandlerMethod.invokeAndHandle(ServletInvocableHandlerMethod.java:117)
  429. at org.springframework.web.servlet.mvc.method.annotation.RequestMappingHandlerAdapter.invokeHandlerMethod(RequestMappingHandlerAdapter.java:903)
  430. at org.springframework.web.servlet.mvc.method.annotation.RequestMappingHandlerAdapter.handleInternal(RequestMappingHandlerAdapter.java:809)
  431. at org.springframework.web.servlet.mvc.method.AbstractHandlerMethodAdapter.handle(AbstractHandlerMethodAdapter.java:87)
  432. at org.springframework.web.servlet.DispatcherServlet.doDispatch(DispatcherServlet.java:1072)
  433. at org.springframework.web.servlet.DispatcherServlet.doService(DispatcherServlet.java:965)
  434. at org.springframework.web.servlet.FrameworkServlet.processRequest(FrameworkServlet.java:1006)
  435. at org.springframework.web.servlet.FrameworkServlet.doGet(FrameworkServlet.java:898)
  436. at javax.servlet.http.HttpServlet.service(HttpServlet.java:529)
  437. at org.springframework.web.servlet.FrameworkServlet.service(FrameworkServlet.java:883)
  438. at org.springframework.test.web.servlet.TestDispatcherServlet.service(TestDispatcherServlet.java:72)
  439. at javax.servlet.http.HttpServlet.service(HttpServlet.java:623)
  440. at org.springframework.mock.web.MockFilterChain$ServletFilterProxy.doFilter(MockFilterChain.java:167)
  441. at org.springframework.mock.web.MockFilterChain.doFilter(MockFilterChain.java:134)
  442. at org.springframework.test.web.servlet.MockMvc.perform(MockMvc.java:201)
  443. at com.zksy.web.controller.cockpit.CockpitFacilityGeometryControllerTest.transactionProxyFailureIsAlsoMappedToSanitized500(CockpitFacilityGeometryControllerTest.java:148)
  444. at java.base/jdk.internal.reflect.NativeMethodAccessorImpl.invoke0(Native Method)
  445. at java.base/jdk.internal.reflect.NativeMethodAccessorImpl.invoke(NativeMethodAccessorImpl.java:77)
  446. at java.base/jdk.internal.reflect.DelegatingMethodAccessorImpl.invoke(DelegatingMethodAccessorImpl.java:43)
  447. at java.base/java.lang.reflect.Method.invoke(Method.java:568)
  448. at org.junit.platform.commons.util.ReflectionUtils.invokeMethod(ReflectionUtils.java:688)
  449. at org.junit.jupiter.engine.execution.MethodInvocation.proceed(MethodInvocation.java:60)
  450. at org.junit.jupiter.engine.execution.InvocationInterceptorChain$ValidatingInvocation.proceed(InvocationInterceptorChain.java:131)
  451. at org.junit.jupiter.engine.extension.TimeoutExtension.intercept(TimeoutExtension.java:149)
  452. at org.junit.jupiter.engine.extension.TimeoutExtension.interceptTestableMethod(TimeoutExtension.java:140)
  453. at org.junit.jupiter.engine.extension.TimeoutExtension.interceptTestMethod(TimeoutExtension.java:84)
  454. at org.junit.jupiter.engine.execution.ExecutableInvoker$ReflectiveInterceptorCall.lambda$ofVoidMethod$0(ExecutableInvoker.java:115)
  455. at org.junit.jupiter.engine.execution.ExecutableInvoker.lambda$invoke$0(ExecutableInvoker.java:105)
  456. at org.junit.jupiter.engine.execution.InvocationInterceptorChain$InterceptedInvocation.proceed(InvocationInterceptorChain.java:106)
  457. at org.junit.jupiter.engine.execution.InvocationInterceptorChain.proceed(InvocationInterceptorChain.java:64)
  458. at org.junit.jupiter.engine.execution.InvocationInterceptorChain.chainAndInvoke(InvocationInterceptorChain.java:45)
  459. at org.junit.jupiter.engine.execution.InvocationInterceptorChain.invoke(InvocationInterceptorChain.java:37)
  460. at org.junit.jupiter.engine.execution.ExecutableInvoker.invoke(ExecutableInvoker.java:104)
  461. at org.junit.jupiter.engine.execution.ExecutableInvoker.invoke(ExecutableInvoker.java:98)
  462. at org.junit.jupiter.engine.descriptor.TestMethodTestDescriptor.lambda$invokeTestMethod$6(TestMethodTestDescriptor.java:210)
  463. at org.junit.platform.engine.support.hierarchical.ThrowableCollector.execute(ThrowableCollector.java:73)
  464. at org.junit.jupiter.engine.descriptor.TestMethodTestDescriptor.invokeTestMethod(TestMethodTestDescriptor.java:206)
  465. at org.junit.jupiter.engine.descriptor.TestMethodTestDescriptor.execute(TestMethodTestDescriptor.java:131)
  466. at org.junit.jupiter.engine.descriptor.TestMethodTestDescriptor.execute(TestMethodTestDescriptor.java:65)
  467. at org.junit.platform.engine.support.hierarchical.NodeTestTask.lambda$executeRecursively$5(NodeTestTask.java:139)
  468. at org.junit.platform.engine.support.hierarchical.ThrowableCollector.execute(ThrowableCollector.java:73)
  469. at org.junit.platform.engine.support.hierarchical.NodeTestTask.lambda$executeRecursively$7(NodeTestTask.java:129)
  470. at org.junit.platform.engine.support.hierarchical.Node.around(Node.java:137)
  471. at org.junit.platform.engine.support.hierarchical.NodeTestTask.lambda$executeRecursively$8(NodeTestTask.java:127)
  472. at org.junit.platform.engine.support.hierarchical.ThrowableCollector.execute(ThrowableCollector.java:73)
  473. at org.junit.platform.engine.support.hierarchical.NodeTestTask.executeRecursively(NodeTestTask.java:126)
  474. at org.junit.platform.engine.support.hierarchical.NodeTestTask.execute(NodeTestTask.java:84)
  475. at java.base/java.util.ArrayList.forEach(ArrayList.java:1511)
  476. at org.junit.platform.engine.support.hierarchical.SameThreadHierarchicalTestExecutorService.invokeAll(SameThreadHierarchicalTestExecutorService.java:38)
  477. at org.junit.platform.engine.support.hierarchical.NodeTestTask.lambda$executeRecursively$5(NodeTestTask.java:143)
  478. at org.junit.platform.engine.support.hierarchical.ThrowableCollector.execute(ThrowableCollector.java:73)
  479. at org.junit.platform.engine.support.hierarchical.NodeTestTask.lambda$executeRecursively$7(NodeTestTask.java:129)
  480. at org.junit.platform.engine.support.hierarchical.Node.around(Node.java:137)
  481. at org.junit.platform.engine.support.hierarchical.NodeTestTask.lambda$executeRecursively$8(NodeTestTask.java:127)
  482. at org.junit.platform.engine.support.hierarchical.ThrowableCollector.execute(ThrowableCollector.java:73)
  483. at org.junit.platform.engine.support.hierarchical.NodeTestTask.executeRecursively(NodeTestTask.java:126)
  484. at org.junit.platform.engine.support.hierarchical.NodeTestTask.execute(NodeTestTask.java:84)
  485. at java.base/java.util.ArrayList.forEach(ArrayList.java:1511)
  486. at org.junit.platform.engine.support.hierarchical.SameThreadHierarchicalTestExecutorService.invokeAll(SameThreadHierarchicalTestExecutorService.java:38)
  487. at org.junit.platform.engine.support.hierarchical.NodeTestTask.lambda$executeRecursively$5(NodeTestTask.java:143)
  488. at org.junit.platform.engine.support.hierarchical.ThrowableCollector.execute(ThrowableCollector.java:73)
  489. at org.junit.platform.engine.support.hierarchical.NodeTestTask.lambda$executeRecursively$7(NodeTestTask.java:129)
  490. at org.junit.platform.engine.support.hierarchical.Node.around(Node.java:137)
  491. at org.junit.platform.engine.support.hierarchical.NodeTestTask.lambda$executeRecursively$8(NodeTestTask.java:127)
  492. at org.junit.platform.engine.support.hierarchical.ThrowableCollector.execute(ThrowableCollector.java:73)
  493. at org.junit.platform.engine.support.hierarchical.NodeTestTask.executeRecursively(NodeTestTask.java:126)
  494. at org.junit.platform.engine.support.hierarchical.NodeTestTask.execute(NodeTestTask.java:84)
  495. at org.junit.platform.engine.support.hierarchical.SameThreadHierarchicalTestExecutorService.submit(SameThreadHierarchicalTestExecutorService.java:32)
  496. at org.junit.platform.engine.support.hierarchical.HierarchicalTestExecutor.execute(HierarchicalTestExecutor.java:57)
  497. at org.junit.platform.engine.support.hierarchical.HierarchicalTestEngine.execute(HierarchicalTestEngine.java:51)
  498. at org.junit.platform.launcher.core.DefaultLauncher.execute(DefaultLauncher.java:220)
  499. at org.junit.platform.launcher.core.DefaultLauncher.lambda$execute$6(DefaultLauncher.java:188)
  500. at org.junit.platform.launcher.core.DefaultLauncher.withInterceptedStreams(DefaultLauncher.java:202)
  501. at org.junit.platform.launcher.core.DefaultLauncher.execute(DefaultLauncher.java:181)
  502. at org.junit.platform.launcher.core.DefaultLauncher.execute(DefaultLauncher.java:128)
  503. at org.apache.maven.surefire.junitplatform.JUnitPlatformProvider.invokeAllTests(JUnitPlatformProvider.java:150)
  504. at org.apache.maven.surefire.junitplatform.JUnitPlatformProvider.invoke(JUnitPlatformProvider.java:124)
  505. at org.apache.maven.surefire.booter.ForkedBooter.invokeProviderInSameClassLoader(ForkedBooter.java:384)
  506. at org.apache.maven.surefire.booter.ForkedBooter.runSuitesInProcess(ForkedBooter.java:345)
  507. at org.apache.maven.surefire.booter.ForkedBooter.execute(ForkedBooter.java:126)
  508. at org.apache.maven.surefire.booter.ForkedBooter.main(ForkedBooter.java:418)
  509. 17:12:02.777 [main] DEBUG org.springframework.web.servlet.mvc.method.annotation.HttpEntityMethodProcessor - Using 'application/json', given [*/*] and supported [application/json, application/*+json]
  510. 17:12:02.778 [main] DEBUG org.springframework.web.servlet.mvc.method.annotation.HttpEntityMethodProcessor - Writing [{msg=facility geometry source unavailable, code=500, data=com.zksy.cockpit.foundation.CockpitErrorPa (truncated)...]
  511. 17:12:02.779 [main] DEBUG org.springframework.web.servlet.mvc.method.annotation.ExceptionHandlerExceptionResolver - Resolved [org.springframework.transaction.CannotCreateTransactionException: private connection detail]
  512. 17:12:02.779 [main] DEBUG org.springframework.test.web.servlet.TestDispatcherServlet - Completed 500 INTERNAL_SERVER_ERROR
  513. 17:12:02.779 [main] DEBUG com.jayway.jsonpath.internal.path.CompiledPath - Evaluating path: $['code']
  514. 17:12:02.779 [main] DEBUG com.jayway.jsonpath.internal.path.CompiledPath - Evaluating path: $['data']['category']
  515. 17:12:02.779 [main] DEBUG com.jayway.jsonpath.internal.path.CompiledPath - Evaluating path: $['data']['message']
  516. 17:12:02.779 [main] DEBUG com.jayway.jsonpath.internal.path.CompiledPath - Evaluating path: $['data']['requestId']
  517. 17:12:02.780 [main] DEBUG org.hibernate.validator.messageinterpolation.ResourceBundleMessageInterpolator - Loaded expression factory via original TCCL
  518. 17:12:02.780 [main] DEBUG org.hibernate.validator.internal.engine.AbstractConfigurationImpl - Setting custom MessageInterpolator of type org.springframework.validation.beanvalidation.LocaleContextMessageInterpolator
  519. 17:12:02.780 [main] DEBUG org.hibernate.validator.internal.engine.AbstractConfigurationImpl - Setting custom ParameterNameProvider of type org.springframework.validation.beanvalidation.LocalValidatorFactoryBean$1
  520. 17:12:02.780 [main] DEBUG org.hibernate.validator.internal.xml.config.ValidationXmlParser - Trying to load META-INF/validation.xml for XML based Validator configuration.
  521. 17:12:02.780 [main] DEBUG org.hibernate.validator.internal.xml.config.ResourceLoaderHelper - Trying to load META-INF/validation.xml via TCCL
  522. 17:12:02.781 [main] DEBUG org.hibernate.validator.internal.xml.config.ResourceLoaderHelper - Trying to load META-INF/validation.xml via Hibernate Validator's class loader
  523. 17:12:02.781 [main] DEBUG org.hibernate.validator.internal.xml.config.ValidationXmlParser - No META-INF/validation.xml found. Using annotation based configuration only.
  524. 17:12:02.781 [main] DEBUG org.hibernate.validator.internal.engine.resolver.TraversableResolvers - Cannot find javax.persistence.Persistence on classpath. Assuming non JPA 2 environment. All properties will per default be traversable.
  525. 17:12:02.782 [main] DEBUG org.hibernate.validator.internal.engine.ValidatorFactoryConfigurationHelper - HV000252: Using org.hibernate.validator.internal.engine.DefaultPropertyNodeNameProvider as property node name provider.
  526. 17:12:02.782 [main] DEBUG org.hibernate.validator.internal.engine.ValidatorFactoryConfigurationHelper - HV000234: Using org.springframework.validation.beanvalidation.LocaleContextMessageInterpolator as ValidatorFactory-scoped message interpolator.
  527. 17:12:02.782 [main] DEBUG org.hibernate.validator.internal.engine.ValidatorFactoryConfigurationHelper - HV000234: Using org.hibernate.validator.internal.engine.resolver.TraverseAllTraversableResolver as ValidatorFactory-scoped traversable resolver.
  528. 17:12:02.782 [main] DEBUG org.hibernate.validator.internal.engine.ValidatorFactoryConfigurationHelper - HV000234: Using org.hibernate.validator.internal.util.ExecutableParameterNameProvider as ValidatorFactory-scoped parameter name provider.
  529. 17:12:02.782 [main] DEBUG org.hibernate.validator.internal.engine.ValidatorFactoryConfigurationHelper - HV000234: Using org.hibernate.validator.internal.engine.DefaultClockProvider as ValidatorFactory-scoped clock provider.
  530. 17:12:02.782 [main] DEBUG org.hibernate.validator.internal.engine.ValidatorFactoryConfigurationHelper - HV000234: Using org.hibernate.validator.internal.engine.scripting.DefaultScriptEvaluatorFactory as ValidatorFactory-scoped script evaluator factory.
  531. 17:12:02.783 [main] DEBUG _org.springframework.web.servlet.HandlerMapping.Mappings -
  532. c.z.w.c.c.CockpitFacilityGeometryController:
  533. {GET [/api/cockpit/v1/infrastructure/geometry]}: geometry()
  534. 17:12:02.784 [main] DEBUG org.springframework.web.servlet.mvc.method.annotation.RequestMappingHandlerMapping - 1 mappings in org.springframework.web.servlet.mvc.method.annotation.RequestMappingHandlerMapping
  535. 17:12:02.789 [main] DEBUG org.springframework.web.servlet.mvc.method.annotation.RequestMappingHandlerAdapter - ControllerAdvice beans: 0 @ModelAttribute, 0 @InitBinder, 1 RequestBodyAdvice, 1 ResponseBodyAdvice
  536. 17:12:02.791 [main] DEBUG org.springframework.web.servlet.mvc.method.annotation.ExceptionHandlerExceptionResolver - ControllerAdvice beans: 0 @ExceptionHandler, 1 ResponseBodyAdvice
  537. 17:12:02.792 [main] INFO org.springframework.mock.web.MockServletContext - Initializing Spring TestDispatcherServlet ''
  538. 17:12:02.792 [main] INFO org.springframework.test.web.servlet.TestDispatcherServlet - Initializing Servlet ''
  539. 17:12:02.792 [main] DEBUG org.springframework.test.web.servlet.TestDispatcherServlet - Detected AcceptHeaderLocaleResolver
  540. 17:12:02.792 [main] DEBUG org.springframework.test.web.servlet.TestDispatcherServlet - Detected FixedThemeResolver
  541. 17:12:02.792 [main] DEBUG org.springframework.test.web.servlet.TestDispatcherServlet - Detected org.springframework.web.servlet.view.DefaultRequestToViewNameTranslator@120aa40b
  542. 17:12:02.792 [main] DEBUG org.springframework.test.web.servlet.TestDispatcherServlet - Detected org.springframework.web.servlet.support.SessionFlashMapManager@32ab408e
  543. 17:12:02.792 [main] DEBUG org.springframework.test.web.servlet.TestDispatcherServlet - enableLoggingRequestDetails='false': request parameters and headers will be masked to prevent unsafe logging of potentially sensitive data
  544. 17:12:02.792 [main] INFO org.springframework.test.web.servlet.TestDispatcherServlet - Completed initialization in 0 ms
  545. 17:12:02.792 [main] DEBUG org.springframework.test.web.servlet.TestDispatcherServlet - GET "/api/cockpit/v1/infrastructure/geometry", parameters={}
  546. 17:12:02.793 [main] DEBUG org.springframework.web.servlet.mvc.method.annotation.RequestMappingHandlerMapping - Mapped to com.zksy.web.controller.cockpit.CockpitFacilityGeometryController#geometry()
  547. 17:12:02.793 [main] DEBUG org.springframework.web.servlet.mvc.method.annotation.ExceptionHandlerExceptionResolver - Using @ExceptionHandler com.zksy.web.controller.cockpit.CockpitFacilityGeometryController#handleReadFailure(HttpServletRequest, RuntimeException)
  548. 17:12:02.793 [main] ERROR com.zksy.web.controller.cockpit.CockpitFacilityGeometryController - Facility geometry read failed
  549. com.zksy.cockpit.foundation.CockpitReadException: private database details
  550. at com.zksy.web.controller.cockpit.CockpitFacilityGeometryController.geometry(CockpitFacilityGeometryController.java:31)
  551. at java.base/jdk.internal.reflect.NativeMethodAccessorImpl.invoke0(Native Method)
  552. at java.base/jdk.internal.reflect.NativeMethodAccessorImpl.invoke(NativeMethodAccessorImpl.java:77)
  553. at java.base/jdk.internal.reflect.DelegatingMethodAccessorImpl.invoke(DelegatingMethodAccessorImpl.java:43)
  554. at java.base/java.lang.reflect.Method.invoke(Method.java:568)
  555. at org.springframework.web.method.support.InvocableHandlerMethod.doInvoke(InvocableHandlerMethod.java:205)
  556. at org.springframework.web.method.support.InvocableHandlerMethod.invokeForRequest(InvocableHandlerMethod.java:150)
  557. at org.springframework.web.servlet.mvc.method.annotation.ServletInvocableHandlerMethod.invokeAndHandle(ServletInvocableHandlerMethod.java:117)
  558. at org.springframework.web.servlet.mvc.method.annotation.RequestMappingHandlerAdapter.invokeHandlerMethod(RequestMappingHandlerAdapter.java:903)
  559. at org.springframework.web.servlet.mvc.method.annotation.RequestMappingHandlerAdapter.handleInternal(RequestMappingHandlerAdapter.java:809)
  560. at org.springframework.web.servlet.mvc.method.AbstractHandlerMethodAdapter.handle(AbstractHandlerMethodAdapter.java:87)
  561. at org.springframework.web.servlet.DispatcherServlet.doDispatch(DispatcherServlet.java:1072)
  562. at org.springframework.web.servlet.DispatcherServlet.doService(DispatcherServlet.java:965)
  563. at org.springframework.web.servlet.FrameworkServlet.processRequest(FrameworkServlet.java:1006)
  564. at org.springframework.web.servlet.FrameworkServlet.doGet(FrameworkServlet.java:898)
  565. at javax.servlet.http.HttpServlet.service(HttpServlet.java:529)
  566. at org.springframework.web.servlet.FrameworkServlet.service(FrameworkServlet.java:883)
  567. at org.springframework.test.web.servlet.TestDispatcherServlet.service(TestDispatcherServlet.java:72)
  568. at javax.servlet.http.HttpServlet.service(HttpServlet.java:623)
  569. at org.springframework.mock.web.MockFilterChain$ServletFilterProxy.doFilter(MockFilterChain.java:167)
  570. at org.springframework.mock.web.MockFilterChain.doFilter(MockFilterChain.java:134)
  571. at org.springframework.test.web.servlet.MockMvc.perform(MockMvc.java:201)
  572. at com.zksy.web.controller.cockpit.CockpitFacilityGeometryControllerTest.sourceFailureReturns500AndStableCategoryRatherThanSuccess(CockpitFacilityGeometryControllerTest.java:88)
  573. at java.base/jdk.internal.reflect.NativeMethodAccessorImpl.invoke0(Native Method)
  574. at java.base/jdk.internal.reflect.NativeMethodAccessorImpl.invoke(NativeMethodAccessorImpl.java:77)
  575. at java.base/jdk.internal.reflect.DelegatingMethodAccessorImpl.invoke(DelegatingMethodAccessorImpl.java:43)
  576. at java.base/java.lang.reflect.Method.invoke(Method.java:568)
  577. at org.junit.platform.commons.util.ReflectionUtils.invokeMethod(ReflectionUtils.java:688)
  578. at org.junit.jupiter.engine.execution.MethodInvocation.proceed(MethodInvocation.java:60)
  579. at org.junit.jupiter.engine.execution.InvocationInterceptorChain$ValidatingInvocation.proceed(InvocationInterceptorChain.java:131)
  580. at org.junit.jupiter.engine.extension.TimeoutExtension.intercept(TimeoutExtension.java:149)
  581. at org.junit.jupiter.engine.extension.TimeoutExtension.interceptTestableMethod(TimeoutExtension.java:140)
  582. at org.junit.jupiter.engine.extension.TimeoutExtension.interceptTestMethod(TimeoutExtension.java:84)
  583. at org.junit.jupiter.engine.execution.ExecutableInvoker$ReflectiveInterceptorCall.lambda$ofVoidMethod$0(ExecutableInvoker.java:115)
  584. at org.junit.jupiter.engine.execution.ExecutableInvoker.lambda$invoke$0(ExecutableInvoker.java:105)
  585. at org.junit.jupiter.engine.execution.InvocationInterceptorChain$InterceptedInvocation.proceed(InvocationInterceptorChain.java:106)
  586. at org.junit.jupiter.engine.execution.InvocationInterceptorChain.proceed(InvocationInterceptorChain.java:64)
  587. at org.junit.jupiter.engine.execution.InvocationInterceptorChain.chainAndInvoke(InvocationInterceptorChain.java:45)
  588. at org.junit.jupiter.engine.execution.InvocationInterceptorChain.invoke(InvocationInterceptorChain.java:37)
  589. at org.junit.jupiter.engine.execution.ExecutableInvoker.invoke(ExecutableInvoker.java:104)
  590. at org.junit.jupiter.engine.execution.ExecutableInvoker.invoke(ExecutableInvoker.java:98)
  591. at org.junit.jupiter.engine.descriptor.TestMethodTestDescriptor.lambda$invokeTestMethod$6(TestMethodTestDescriptor.java:210)
  592. at org.junit.platform.engine.support.hierarchical.ThrowableCollector.execute(ThrowableCollector.java:73)
  593. at org.junit.jupiter.engine.descriptor.TestMethodTestDescriptor.invokeTestMethod(TestMethodTestDescriptor.java:206)
  594. at org.junit.jupiter.engine.descriptor.TestMethodTestDescriptor.execute(TestMethodTestDescriptor.java:131)
  595. at org.junit.jupiter.engine.descriptor.TestMethodTestDescriptor.execute(TestMethodTestDescriptor.java:65)
  596. at org.junit.platform.engine.support.hierarchical.NodeTestTask.lambda$executeRecursively$5(NodeTestTask.java:139)
  597. at org.junit.platform.engine.support.hierarchical.ThrowableCollector.execute(ThrowableCollector.java:73)
  598. at org.junit.platform.engine.support.hierarchical.NodeTestTask.lambda$executeRecursively$7(NodeTestTask.java:129)
  599. at org.junit.platform.engine.support.hierarchical.Node.around(Node.java:137)
  600. at org.junit.platform.engine.support.hierarchical.NodeTestTask.lambda$executeRecursively$8(NodeTestTask.java:127)
  601. at org.junit.platform.engine.support.hierarchical.ThrowableCollector.execute(ThrowableCollector.java:73)
  602. at org.junit.platform.engine.support.hierarchical.NodeTestTask.executeRecursively(NodeTestTask.java:126)
  603. at org.junit.platform.engine.support.hierarchical.NodeTestTask.execute(NodeTestTask.java:84)
  604. at java.base/java.util.ArrayList.forEach(ArrayList.java:1511)
  605. at org.junit.platform.engine.support.hierarchical.SameThreadHierarchicalTestExecutorService.invokeAll(SameThreadHierarchicalTestExecutorService.java:38)
  606. at org.junit.platform.engine.support.hierarchical.NodeTestTask.lambda$executeRecursively$5(NodeTestTask.java:143)
  607. at org.junit.platform.engine.support.hierarchical.ThrowableCollector.execute(ThrowableCollector.java:73)
  608. at org.junit.platform.engine.support.hierarchical.NodeTestTask.lambda$executeRecursively$7(NodeTestTask.java:129)
  609. at org.junit.platform.engine.support.hierarchical.Node.around(Node.java:137)
  610. at org.junit.platform.engine.support.hierarchical.NodeTestTask.lambda$executeRecursively$8(NodeTestTask.java:127)
  611. at org.junit.platform.engine.support.hierarchical.ThrowableCollector.execute(ThrowableCollector.java:73)
  612. at org.junit.platform.engine.support.hierarchical.NodeTestTask.executeRecursively(NodeTestTask.java:126)
  613. at org.junit.platform.engine.support.hierarchical.NodeTestTask.execute(NodeTestTask.java:84)
  614. at java.base/java.util.ArrayList.forEach(ArrayList.java:1511)
  615. at org.junit.platform.engine.support.hierarchical.SameThreadHierarchicalTestExecutorService.invokeAll(SameThreadHierarchicalTestExecutorService.java:38)
  616. at org.junit.platform.engine.support.hierarchical.NodeTestTask.lambda$executeRecursively$5(NodeTestTask.java:143)
  617. at org.junit.platform.engine.support.hierarchical.ThrowableCollector.execute(ThrowableCollector.java:73)
  618. at org.junit.platform.engine.support.hierarchical.NodeTestTask.lambda$executeRecursively$7(NodeTestTask.java:129)
  619. at org.junit.platform.engine.support.hierarchical.Node.around(Node.java:137)
  620. at org.junit.platform.engine.support.hierarchical.NodeTestTask.lambda$executeRecursively$8(NodeTestTask.java:127)
  621. at org.junit.platform.engine.support.hierarchical.ThrowableCollector.execute(ThrowableCollector.java:73)
  622. at org.junit.platform.engine.support.hierarchical.NodeTestTask.executeRecursively(NodeTestTask.java:126)
  623. at org.junit.platform.engine.support.hierarchical.NodeTestTask.execute(NodeTestTask.java:84)
  624. at org.junit.platform.engine.support.hierarchical.SameThreadHierarchicalTestExecutorService.submit(SameThreadHierarchicalTestExecutorService.java:32)
  625. at org.junit.platform.engine.support.hierarchical.HierarchicalTestExecutor.execute(HierarchicalTestExecutor.java:57)
  626. at org.junit.platform.engine.support.hierarchical.HierarchicalTestEngine.execute(HierarchicalTestEngine.java:51)
  627. at org.junit.platform.launcher.core.DefaultLauncher.execute(DefaultLauncher.java:220)
  628. at org.junit.platform.launcher.core.DefaultLauncher.lambda$execute$6(DefaultLauncher.java:188)
  629. at org.junit.platform.launcher.core.DefaultLauncher.withInterceptedStreams(DefaultLauncher.java:202)
  630. at org.junit.platform.launcher.core.DefaultLauncher.execute(DefaultLauncher.java:181)
  631. at org.junit.platform.launcher.core.DefaultLauncher.execute(DefaultLauncher.java:128)
  632. at org.apache.maven.surefire.junitplatform.JUnitPlatformProvider.invokeAllTests(JUnitPlatformProvider.java:150)
  633. at org.apache.maven.surefire.junitplatform.JUnitPlatformProvider.invoke(JUnitPlatformProvider.java:124)
  634. at org.apache.maven.surefire.booter.ForkedBooter.invokeProviderInSameClassLoader(ForkedBooter.java:384)
  635. at org.apache.maven.surefire.booter.ForkedBooter.runSuitesInProcess(ForkedBooter.java:345)
  636. at org.apache.maven.surefire.booter.ForkedBooter.execute(ForkedBooter.java:126)
  637. at org.apache.maven.surefire.booter.ForkedBooter.main(ForkedBooter.java:418)
  638. 17:12:02.794 [main] DEBUG org.springframework.web.servlet.mvc.method.annotation.HttpEntityMethodProcessor - Using 'application/json', given [*/*] and supported [application/json, application/*+json]
  639. 17:12:02.794 [main] DEBUG org.springframework.web.servlet.mvc.method.annotation.HttpEntityMethodProcessor - Writing [{msg=facility geometry source unavailable, code=500, data=com.zksy.cockpit.foundation.CockpitErrorPa (truncated)...]
  640. 17:12:02.794 [main] DEBUG org.springframework.web.servlet.mvc.method.annotation.ExceptionHandlerExceptionResolver - Resolved [com.zksy.cockpit.foundation.CockpitReadException: private database details]
  641. 17:12:02.794 [main] DEBUG org.springframework.test.web.servlet.TestDispatcherServlet - Completed 500 INTERNAL_SERVER_ERROR
  642. 17:12:02.794 [main] DEBUG com.jayway.jsonpath.internal.path.CompiledPath - Evaluating path: $['code']
  643. 17:12:02.794 [main] DEBUG com.jayway.jsonpath.internal.path.CompiledPath - Evaluating path: $['data']['category']
  644. 17:12:02.795 [main] DEBUG com.jayway.jsonpath.internal.path.CompiledPath - Evaluating path: $['data']['message']
  645. 17:12:02.795 [main] DEBUG com.jayway.jsonpath.internal.path.CompiledPath - Evaluating path: $['data']['requestId']
  646. [INFO] Tests run: 6, Failures: 0, Errors: 0, Skipped: 0, Time elapsed: 1.498 s - in com.zksy.web.controller.cockpit.CockpitFacilityGeometryControllerTest
  647. [INFO] Running com.zksy.web.controller.cockpit.CockpitFacilityGeometryServiceTest
  648. 17:12:02.867 [main] ERROR com.zksy.cockpit.geometry.CockpitFacilityGeometryService - Facility geometry source read failed
  649. java.lang.IllegalStateException: private database detail
  650. at com.zksy.cockpit.geometry.CockpitFacilityGeometryService.load(CockpitFacilityGeometryService.java:60)
  651. at org.junit.jupiter.api.AssertThrows.assertThrows(AssertThrows.java:55)
  652. at org.junit.jupiter.api.AssertThrows.assertThrows(AssertThrows.java:37)
  653. at org.junit.jupiter.api.Assertions.assertThrows(Assertions.java:3007)
  654. at com.zksy.web.controller.cockpit.CockpitFacilityGeometryServiceTest.aFailedSourceNeverProducesAnEmptyOrPartialSuccess(CockpitFacilityGeometryServiceTest.java:248)
  655. at java.base/jdk.internal.reflect.NativeMethodAccessorImpl.invoke0(Native Method)
  656. at java.base/jdk.internal.reflect.NativeMethodAccessorImpl.invoke(NativeMethodAccessorImpl.java:77)
  657. at java.base/jdk.internal.reflect.DelegatingMethodAccessorImpl.invoke(DelegatingMethodAccessorImpl.java:43)
  658. at java.base/java.lang.reflect.Method.invoke(Method.java:568)
  659. at org.junit.platform.commons.util.ReflectionUtils.invokeMethod(ReflectionUtils.java:688)
  660. at org.junit.jupiter.engine.execution.MethodInvocation.proceed(MethodInvocation.java:60)
  661. at org.junit.jupiter.engine.execution.InvocationInterceptorChain$ValidatingInvocation.proceed(InvocationInterceptorChain.java:131)
  662. at org.junit.jupiter.engine.extension.TimeoutExtension.intercept(TimeoutExtension.java:149)
  663. at org.junit.jupiter.engine.extension.TimeoutExtension.interceptTestableMethod(TimeoutExtension.java:140)
  664. at org.junit.jupiter.engine.extension.TimeoutExtension.interceptTestMethod(TimeoutExtension.java:84)
  665. at org.junit.jupiter.engine.execution.ExecutableInvoker$ReflectiveInterceptorCall.lambda$ofVoidMethod$0(ExecutableInvoker.java:115)
  666. at org.junit.jupiter.engine.execution.ExecutableInvoker.lambda$invoke$0(ExecutableInvoker.java:105)
  667. at org.junit.jupiter.engine.execution.InvocationInterceptorChain$InterceptedInvocation.proceed(InvocationInterceptorChain.java:106)
  668. at org.junit.jupiter.engine.execution.InvocationInterceptorChain.proceed(InvocationInterceptorChain.java:64)
  669. at org.junit.jupiter.engine.execution.InvocationInterceptorChain.chainAndInvoke(InvocationInterceptorChain.java:45)
  670. at org.junit.jupiter.engine.execution.InvocationInterceptorChain.invoke(InvocationInterceptorChain.java:37)
  671. at org.junit.jupiter.engine.execution.ExecutableInvoker.invoke(ExecutableInvoker.java:104)
  672. at org.junit.jupiter.engine.execution.ExecutableInvoker.invoke(ExecutableInvoker.java:98)
  673. at org.junit.jupiter.engine.descriptor.TestMethodTestDescriptor.lambda$invokeTestMethod$6(TestMethodTestDescriptor.java:210)
  674. at org.junit.platform.engine.support.hierarchical.ThrowableCollector.execute(ThrowableCollector.java:73)
  675. at org.junit.jupiter.engine.descriptor.TestMethodTestDescriptor.invokeTestMethod(TestMethodTestDescriptor.java:206)
  676. at org.junit.jupiter.engine.descriptor.TestMethodTestDescriptor.execute(TestMethodTestDescriptor.java:131)
  677. at org.junit.jupiter.engine.descriptor.TestMethodTestDescriptor.execute(TestMethodTestDescriptor.java:65)
  678. at org.junit.platform.engine.support.hierarchical.NodeTestTask.lambda$executeRecursively$5(NodeTestTask.java:139)
  679. at org.junit.platform.engine.support.hierarchical.ThrowableCollector.execute(ThrowableCollector.java:73)
  680. at org.junit.platform.engine.support.hierarchical.NodeTestTask.lambda$executeRecursively$7(NodeTestTask.java:129)
  681. at org.junit.platform.engine.support.hierarchical.Node.around(Node.java:137)
  682. at org.junit.platform.engine.support.hierarchical.NodeTestTask.lambda$executeRecursively$8(NodeTestTask.java:127)
  683. at org.junit.platform.engine.support.hierarchical.ThrowableCollector.execute(ThrowableCollector.java:73)
  684. at org.junit.platform.engine.support.hierarchical.NodeTestTask.executeRecursively(NodeTestTask.java:126)
  685. at org.junit.platform.engine.support.hierarchical.NodeTestTask.execute(NodeTestTask.java:84)
  686. at java.base/java.util.ArrayList.forEach(ArrayList.java:1511)
  687. at org.junit.platform.engine.support.hierarchical.SameThreadHierarchicalTestExecutorService.invokeAll(SameThreadHierarchicalTestExecutorService.java:38)
  688. at org.junit.platform.engine.support.hierarchical.NodeTestTask.lambda$executeRecursively$5(NodeTestTask.java:143)
  689. at org.junit.platform.engine.support.hierarchical.ThrowableCollector.execute(ThrowableCollector.java:73)
  690. at org.junit.platform.engine.support.hierarchical.NodeTestTask.lambda$executeRecursively$7(NodeTestTask.java:129)
  691. at org.junit.platform.engine.support.hierarchical.Node.around(Node.java:137)
  692. at org.junit.platform.engine.support.hierarchical.NodeTestTask.lambda$executeRecursively$8(NodeTestTask.java:127)
  693. at org.junit.platform.engine.support.hierarchical.ThrowableCollector.execute(ThrowableCollector.java:73)
  694. at org.junit.platform.engine.support.hierarchical.NodeTestTask.executeRecursively(NodeTestTask.java:126)
  695. at org.junit.platform.engine.support.hierarchical.NodeTestTask.execute(NodeTestTask.java:84)
  696. at java.base/java.util.ArrayList.forEach(ArrayList.java:1511)
  697. at org.junit.platform.engine.support.hierarchical.SameThreadHierarchicalTestExecutorService.invokeAll(SameThreadHierarchicalTestExecutorService.java:38)
  698. at org.junit.platform.engine.support.hierarchical.NodeTestTask.lambda$executeRecursively$5(NodeTestTask.java:143)
  699. at org.junit.platform.engine.support.hierarchical.ThrowableCollector.execute(ThrowableCollector.java:73)
  700. at org.junit.platform.engine.support.hierarchical.NodeTestTask.lambda$executeRecursively$7(NodeTestTask.java:129)
  701. at org.junit.platform.engine.support.hierarchical.Node.around(Node.java:137)
  702. at org.junit.platform.engine.support.hierarchical.NodeTestTask.lambda$executeRecursively$8(NodeTestTask.java:127)
  703. at org.junit.platform.engine.support.hierarchical.ThrowableCollector.execute(ThrowableCollector.java:73)
  704. at org.junit.platform.engine.support.hierarchical.NodeTestTask.executeRecursively(NodeTestTask.java:126)
  705. at org.junit.platform.engine.support.hierarchical.NodeTestTask.execute(NodeTestTask.java:84)
  706. at org.junit.platform.engine.support.hierarchical.SameThreadHierarchicalTestExecutorService.submit(SameThreadHierarchicalTestExecutorService.java:32)
  707. at org.junit.platform.engine.support.hierarchical.HierarchicalTestExecutor.execute(HierarchicalTestExecutor.java:57)
  708. at org.junit.platform.engine.support.hierarchical.HierarchicalTestEngine.execute(HierarchicalTestEngine.java:51)
  709. at org.junit.platform.launcher.core.DefaultLauncher.execute(DefaultLauncher.java:220)
  710. at org.junit.platform.launcher.core.DefaultLauncher.lambda$execute$6(DefaultLauncher.java:188)
  711. at org.junit.platform.launcher.core.DefaultLauncher.withInterceptedStreams(DefaultLauncher.java:202)
  712. at org.junit.platform.launcher.core.DefaultLauncher.execute(DefaultLauncher.java:181)
  713. at org.junit.platform.launcher.core.DefaultLauncher.execute(DefaultLauncher.java:128)
  714. at org.apache.maven.surefire.junitplatform.JUnitPlatformProvider.invokeAllTests(JUnitPlatformProvider.java:150)
  715. at org.apache.maven.surefire.junitplatform.JUnitPlatformProvider.invoke(JUnitPlatformProvider.java:124)
  716. at org.apache.maven.surefire.booter.ForkedBooter.invokeProviderInSameClassLoader(ForkedBooter.java:384)
  717. at org.apache.maven.surefire.booter.ForkedBooter.runSuitesInProcess(ForkedBooter.java:345)
  718. at org.apache.maven.surefire.booter.ForkedBooter.execute(ForkedBooter.java:126)
  719. at org.apache.maven.surefire.booter.ForkedBooter.main(ForkedBooter.java:418)
  720. 17:12:02.882 [main] ERROR com.zksy.cockpit.geometry.CockpitFacilityGeometryService - Facility geometry source read failed
  721. java.lang.NullPointerException: null
  722. at java.base/java.util.Objects.requireNonNull(Objects.java:208)
  723. at com.zksy.cockpit.geometry.CockpitFacilityGeometryService.load(CockpitFacilityGeometryService.java:66)
  724. at org.junit.jupiter.api.AssertThrows.assertThrows(AssertThrows.java:55)
  725. at org.junit.jupiter.api.AssertThrows.assertThrows(AssertThrows.java:37)
  726. at org.junit.jupiter.api.Assertions.assertThrows(Assertions.java:3007)
  727. at com.zksy.web.controller.cockpit.CockpitFacilityGeometryServiceTest.aNullSourceIsAReadFailureRatherThanASuccessfulEmptyCollection(CockpitFacilityGeometryServiceTest.java:256)
  728. at java.base/jdk.internal.reflect.NativeMethodAccessorImpl.invoke0(Native Method)
  729. at java.base/jdk.internal.reflect.NativeMethodAccessorImpl.invoke(NativeMethodAccessorImpl.java:77)
  730. at java.base/jdk.internal.reflect.DelegatingMethodAccessorImpl.invoke(DelegatingMethodAccessorImpl.java:43)
  731. at java.base/java.lang.reflect.Method.invoke(Method.java:568)
  732. at org.junit.platform.commons.util.ReflectionUtils.invokeMethod(ReflectionUtils.java:688)
  733. at org.junit.jupiter.engine.execution.MethodInvocation.proceed(MethodInvocation.java:60)
  734. at org.junit.jupiter.engine.execution.InvocationInterceptorChain$ValidatingInvocation.proceed(InvocationInterceptorChain.java:131)
  735. at org.junit.jupiter.engine.extension.TimeoutExtension.intercept(TimeoutExtension.java:149)
  736. at org.junit.jupiter.engine.extension.TimeoutExtension.interceptTestableMethod(TimeoutExtension.java:140)
  737. at org.junit.jupiter.engine.extension.TimeoutExtension.interceptTestMethod(TimeoutExtension.java:84)
  738. at org.junit.jupiter.engine.execution.ExecutableInvoker$ReflectiveInterceptorCall.lambda$ofVoidMethod$0(ExecutableInvoker.java:115)
  739. at org.junit.jupiter.engine.execution.ExecutableInvoker.lambda$invoke$0(ExecutableInvoker.java:105)
  740. at org.junit.jupiter.engine.execution.InvocationInterceptorChain$InterceptedInvocation.proceed(InvocationInterceptorChain.java:106)
  741. at org.junit.jupiter.engine.execution.InvocationInterceptorChain.proceed(InvocationInterceptorChain.java:64)
  742. at org.junit.jupiter.engine.execution.InvocationInterceptorChain.chainAndInvoke(InvocationInterceptorChain.java:45)
  743. at org.junit.jupiter.engine.execution.InvocationInterceptorChain.invoke(InvocationInterceptorChain.java:37)
  744. at org.junit.jupiter.engine.execution.ExecutableInvoker.invoke(ExecutableInvoker.java:104)
  745. at org.junit.jupiter.engine.execution.ExecutableInvoker.invoke(ExecutableInvoker.java:98)
  746. at org.junit.jupiter.engine.descriptor.TestMethodTestDescriptor.lambda$invokeTestMethod$6(TestMethodTestDescriptor.java:210)
  747. at org.junit.platform.engine.support.hierarchical.ThrowableCollector.execute(ThrowableCollector.java:73)
  748. at org.junit.jupiter.engine.descriptor.TestMethodTestDescriptor.invokeTestMethod(TestMethodTestDescriptor.java:206)
  749. at org.junit.jupiter.engine.descriptor.TestMethodTestDescriptor.execute(TestMethodTestDescriptor.java:131)
  750. at org.junit.jupiter.engine.descriptor.TestMethodTestDescriptor.execute(TestMethodTestDescriptor.java:65)
  751. at org.junit.platform.engine.support.hierarchical.NodeTestTask.lambda$executeRecursively$5(NodeTestTask.java:139)
  752. at org.junit.platform.engine.support.hierarchical.ThrowableCollector.execute(ThrowableCollector.java:73)
  753. at org.junit.platform.engine.support.hierarchical.NodeTestTask.lambda$executeRecursively$7(NodeTestTask.java:129)
  754. at org.junit.platform.engine.support.hierarchical.Node.around(Node.java:137)
  755. at org.junit.platform.engine.support.hierarchical.NodeTestTask.lambda$executeRecursively$8(NodeTestTask.java:127)
  756. at org.junit.platform.engine.support.hierarchical.ThrowableCollector.execute(ThrowableCollector.java:73)
  757. at org.junit.platform.engine.support.hierarchical.NodeTestTask.executeRecursively(NodeTestTask.java:126)
  758. at org.junit.platform.engine.support.hierarchical.NodeTestTask.execute(NodeTestTask.java:84)
  759. at java.base/java.util.ArrayList.forEach(ArrayList.java:1511)
  760. at org.junit.platform.engine.support.hierarchical.SameThreadHierarchicalTestExecutorService.invokeAll(SameThreadHierarchicalTestExecutorService.java:38)
  761. at org.junit.platform.engine.support.hierarchical.NodeTestTask.lambda$executeRecursively$5(NodeTestTask.java:143)
  762. at org.junit.platform.engine.support.hierarchical.ThrowableCollector.execute(ThrowableCollector.java:73)
  763. at org.junit.platform.engine.support.hierarchical.NodeTestTask.lambda$executeRecursively$7(NodeTestTask.java:129)
  764. at org.junit.platform.engine.support.hierarchical.Node.around(Node.java:137)
  765. at org.junit.platform.engine.support.hierarchical.NodeTestTask.lambda$executeRecursively$8(NodeTestTask.java:127)
  766. at org.junit.platform.engine.support.hierarchical.ThrowableCollector.execute(ThrowableCollector.java:73)
  767. at org.junit.platform.engine.support.hierarchical.NodeTestTask.executeRecursively(NodeTestTask.java:126)
  768. at org.junit.platform.engine.support.hierarchical.NodeTestTask.execute(NodeTestTask.java:84)
  769. at java.base/java.util.ArrayList.forEach(ArrayList.java:1511)
  770. at org.junit.platform.engine.support.hierarchical.SameThreadHierarchicalTestExecutorService.invokeAll(SameThreadHierarchicalTestExecutorService.java:38)
  771. at org.junit.platform.engine.support.hierarchical.NodeTestTask.lambda$executeRecursively$5(NodeTestTask.java:143)
  772. at org.junit.platform.engine.support.hierarchical.ThrowableCollector.execute(ThrowableCollector.java:73)
  773. at org.junit.platform.engine.support.hierarchical.NodeTestTask.lambda$executeRecursively$7(NodeTestTask.java:129)
  774. at org.junit.platform.engine.support.hierarchical.Node.around(Node.java:137)
  775. at org.junit.platform.engine.support.hierarchical.NodeTestTask.lambda$executeRecursively$8(NodeTestTask.java:127)
  776. at org.junit.platform.engine.support.hierarchical.ThrowableCollector.execute(ThrowableCollector.java:73)
  777. at org.junit.platform.engine.support.hierarchical.NodeTestTask.executeRecursively(NodeTestTask.java:126)
  778. at org.junit.platform.engine.support.hierarchical.NodeTestTask.execute(NodeTestTask.java:84)
  779. at org.junit.platform.engine.support.hierarchical.SameThreadHierarchicalTestExecutorService.submit(SameThreadHierarchicalTestExecutorService.java:32)
  780. at org.junit.platform.engine.support.hierarchical.HierarchicalTestExecutor.execute(HierarchicalTestExecutor.java:57)
  781. at org.junit.platform.engine.support.hierarchical.HierarchicalTestEngine.execute(HierarchicalTestEngine.java:51)
  782. at org.junit.platform.launcher.core.DefaultLauncher.execute(DefaultLauncher.java:220)
  783. at org.junit.platform.launcher.core.DefaultLauncher.lambda$execute$6(DefaultLauncher.java:188)
  784. at org.junit.platform.launcher.core.DefaultLauncher.withInterceptedStreams(DefaultLauncher.java:202)
  785. at org.junit.platform.launcher.core.DefaultLauncher.execute(DefaultLauncher.java:181)
  786. at org.junit.platform.launcher.core.DefaultLauncher.execute(DefaultLauncher.java:128)
  787. at org.apache.maven.surefire.junitplatform.JUnitPlatformProvider.invokeAllTests(JUnitPlatformProvider.java:150)
  788. at org.apache.maven.surefire.junitplatform.JUnitPlatformProvider.invoke(JUnitPlatformProvider.java:124)
  789. at org.apache.maven.surefire.booter.ForkedBooter.invokeProviderInSameClassLoader(ForkedBooter.java:384)
  790. at org.apache.maven.surefire.booter.ForkedBooter.runSuitesInProcess(ForkedBooter.java:345)
  791. at org.apache.maven.surefire.booter.ForkedBooter.execute(ForkedBooter.java:126)
  792. at org.apache.maven.surefire.booter.ForkedBooter.main(ForkedBooter.java:418)
  793. [INFO] Tests run: 16, Failures: 0, Errors: 0, Skipped: 0, Time elapsed: 0.079 s - in com.zksy.web.controller.cockpit.CockpitFacilityGeometryServiceTest
  794. [INFO]
  795. [INFO] Results:
  796. [INFO]
  797. [INFO] Tests run: 22, Failures: 0, Errors: 0, Skipped: 0
  798. [INFO]
  799. [INFO] ------------------------------------------------------------------------
  800. [INFO] Reactor Summary:
  801. [INFO]
  802. [INFO] pipe-ner-server 1.0.0 .............................. SUCCESS [ 0.001 s]
  803. [INFO] pipe-network-service 3.9.0 ......................... SUCCESS [ 0.001 s]
  804. [INFO] zksy-common 3.9.0 .................................. SUCCESS [ 1.061 s]
  805. [INFO] zksy-system 3.9.0 .................................. SUCCESS [ 12.305 s]
  806. [INFO] zksy-framework 3.9.0 ............................... SUCCESS [ 0.146 s]
  807. [INFO] zksy-quartz 3.9.0 .................................. SUCCESS [ 1.018 s]
  808. [INFO] zksy-generator 3.9.0 ............................... SUCCESS [ 0.072 s]
  809. [INFO] zksy-admin 3.9.0 ................................... SUCCESS [ 7.792 s]
  810. [INFO] ------------------------------------------------------------------------
  811. [INFO] BUILD SUCCESS
  812. [INFO] ------------------------------------------------------------------------
  813. [INFO] Total time: 22.763 s
  814. [INFO] Finished at: 2026-10-13T17:12:03+08:00
  815. [INFO] ------------------------------------------------------------------------